Diff of the two buildlogs:

--
--- b1/build.log	2023-05-06 05:58:47.839149498 +0000
+++ b2/build.log	2023-05-06 06:03:28.662838158 +0000
@@ -1,6 +1,6 @@
 I: pbuilder: network access will be disabled during build
-I: Current time: Fri Jun  7 00:14:26 -12 2024
-I: pbuilder-time-stamp: 1717762466
+I: Current time: Sat May  6 19:58:50 +14 2023
+I: pbuilder-time-stamp: 1683352730
 I: Building the build Environment
 I: extracting base tarball [/var/cache/pbuilder/bookworm-reproducible-base.tgz]
 I: copying local configuration
@@ -16,7 +16,7 @@
 I: copying [./junit4_4.13.2.orig.tar.xz]
 I: copying [./junit4_4.13.2-3.debian.tar.xz]
 I: Extracting source
-gpgv: Signature made Tue Oct  4 22:43:31 2022 -12
+gpgv: Signature made Thu Oct  6 00:43:31 2022 +14
 gpgv:                using RSA key B8CE4DE21080DCF903E16C40F513C419E4B9D0AC
 gpgv:                issuer "ebourg@apache.org"
 gpgv: Can't check signature: No public key
@@ -31,52 +31,84 @@
 dpkg-source: info: applying hamcrest-compatibility.patch
 I: using fakeroot in build.
 I: Installing the build-deps
-I: user script /srv/workspace/pbuilder/7658/tmp/hooks/D02_print_environment starting
+I: user script /srv/workspace/pbuilder/28394/tmp/hooks/D01_modify_environment starting
+debug: Running on codethink12-arm64.
+I: Changing host+domainname to test build reproducibility
+I: Adding a custom variable just for the fun of it...
+I: Changing /bin/sh to bash
+'/bin/sh' -> '/bin/bash'
+lrwxrwxrwx 1 root root 9 May  6 19:59 /bin/sh -> /bin/bash
+I: Setting pbuilder2's login shell to /bin/bash
+I: Setting pbuilder2's GECOS to second user,second room,second work-phone,second home-phone,second other
+I: user script /srv/workspace/pbuilder/28394/tmp/hooks/D01_modify_environment finished
+I: user script /srv/workspace/pbuilder/28394/tmp/hooks/D02_print_environment starting
 I: set
-  BUILDDIR='/build'
-  BUILDUSERGECOS='first user,first room,first work-phone,first home-phone,first other'
-  BUILDUSERNAME='pbuilder1'
-  BUILD_ARCH='arm64'
-  DEBIAN_FRONTEND='noninteractive'
+  BASH=/bin/sh
+  BASHOPTS=checkwinsize:cmdhist:complete_fullquote:extquote:force_fignore:globasciiranges:globskipdots:hostcomplete:interactive_comments:patsub_replacement:progcomp:promptvars:sourcepath
+  BASH_ALIASES=()
+  BASH_ARGC=()
+  BASH_ARGV=()
+  BASH_CMDS=()
+  BASH_LINENO=([0]="12" [1]="0")
+  BASH_LOADABLES_PATH=/usr/local/lib/bash:/usr/lib/bash:/opt/local/lib/bash:/usr/pkg/lib/bash:/opt/pkg/lib/bash:.
+  BASH_SOURCE=([0]="/tmp/hooks/D02_print_environment" [1]="/tmp/hooks/D02_print_environment")
+  BASH_VERSINFO=([0]="5" [1]="2" [2]="15" [3]="1" [4]="release" [5]="aarch64-unknown-linux-gnu")
+  BASH_VERSION='5.2.15(1)-release'
+  BUILDDIR=/build
+  BUILDUSERGECOS='second user,second room,second work-phone,second home-phone,second other'
+  BUILDUSERNAME=pbuilder2
+  BUILD_ARCH=arm64
+  DEBIAN_FRONTEND=noninteractive
   DEB_BUILD_OPTIONS='buildinfo=+all reproducible=+all parallel=8'
-  DISTRIBUTION='bookworm'
-  HOME='/var/lib/jenkins'
-  HOST_ARCH='arm64'
+  DIRSTACK=()
+  DISTRIBUTION=bookworm
+  EUID=0
+  FUNCNAME=([0]="Echo" [1]="main")
+  GROUPS=()
+  HOME=/var/lib/jenkins
+  HOSTNAME=i-capture-the-hostname
+  HOSTTYPE=aarch64
+  HOST_ARCH=arm64
   IFS=' 	
   '
-  LANG='C'
-  LANGUAGE='en_US:en'
-  LC_ALL='C'
-  MAIL='/var/mail/root'
-  OPTIND='1'
-  PATH='/usr/sbin:/usr/bin:/sbin:/bin:/usr/games'
-  PBCURRENTCOMMANDLINEOPERATION='build'
-  PBUILDER_OPERATION='build'
-  PBUILDER_PKGDATADIR='/usr/share/pbuilder'
-  PBUILDER_PKGLIBDIR='/usr/lib/pbuilder'
-  PBUILDER_SYSCONFDIR='/etc'
-  PPID='7658'
-  PS1='# '
-  PS2='> '
+  LANG=C
+  LANGUAGE=nl_BE:nl
+  LC_ALL=C
+  MACHTYPE=aarch64-unknown-linux-gnu
+  MAIL=/var/mail/root
+  OPTERR=1
+  OPTIND=1
+  OSTYPE=linux-gnu
+  PATH=/usr/sbin:/usr/bin:/sbin:/bin:/usr/games:/i/capture/the/path
+  PBCURRENTCOMMANDLINEOPERATION=build
+  PBUILDER_OPERATION=build
+  PBUILDER_PKGDATADIR=/usr/share/pbuilder
+  PBUILDER_PKGLIBDIR=/usr/lib/pbuilder
+  PBUILDER_SYSCONFDIR=/etc
+  PIPESTATUS=([0]="0")
+  POSIXLY_CORRECT=y
+  PPID=28394
   PS4='+ '
-  PWD='/'
-  SHELL='/bin/bash'
-  SHLVL='2'
-  SUDO_COMMAND='/usr/bin/timeout -k 18.1h 18h /usr/bin/ionice -c 3 /usr/bin/nice /usr/sbin/pbuilder --build --configfile /srv/reproducible-results/rbuild-debian/r-b-build.LMyBm0dD/pbuilderrc_8pZD --distribution bookworm --hookdir /etc/pbuilder/first-build-hooks --debbuildopts -b --basetgz /var/cache/pbuilder/bookworm-reproducible-base.tgz --buildresult /srv/reproducible-results/rbuild-debian/r-b-build.LMyBm0dD/b1 --logfile b1/build.log junit4_4.13.2-3.dsc'
-  SUDO_GID='117'
-  SUDO_UID='110'
-  SUDO_USER='jenkins'
-  TERM='unknown'
-  TZ='/usr/share/zoneinfo/Etc/GMT+12'
-  USER='root'
-  USERNAME='root'
-  _='/usr/bin/systemd-run'
-  http_proxy='http://192.168.101.16:3128'
+  PWD=/
+  SHELL=/bin/bash
+  SHELLOPTS=braceexpand:errexit:hashall:interactive-comments:posix
+  SHLVL=3
+  SUDO_COMMAND='/usr/bin/timeout -k 24.1h 24h /usr/bin/ionice -c 3 /usr/bin/nice -n 11 /usr/bin/unshare --uts -- /usr/sbin/pbuilder --build --configfile /srv/reproducible-results/rbuild-debian/r-b-build.LMyBm0dD/pbuilderrc_AJIC --distribution bookworm --hookdir /etc/pbuilder/rebuild-hooks --debbuildopts -b --basetgz /var/cache/pbuilder/bookworm-reproducible-base.tgz --buildresult /srv/reproducible-results/rbuild-debian/r-b-build.LMyBm0dD/b2 --logfile b2/build.log --extrapackages usrmerge junit4_4.13.2-3.dsc'
+  SUDO_GID=117
+  SUDO_UID=110
+  SUDO_USER=jenkins
+  TERM=unknown
+  TZ=/usr/share/zoneinfo/Etc/GMT-14
+  UID=0
+  USER=root
+  USERNAME=root
+  _='I: set'
+  http_proxy=http://192.168.101.16:3128
 I: uname -a
-  Linux codethink9-arm64 4.15.0-210-generic #221-Ubuntu SMP Tue Apr 18 08:32:48 UTC 2023 aarch64 GNU/Linux
+  Linux i-capture-the-hostname 4.15.0-210-generic #221-Ubuntu SMP Tue Apr 18 08:32:48 UTC 2023 aarch64 GNU/Linux
 I: ls -l /bin
-  lrwxrwxrwx 1 root root 7 Jun  4 05:33 /bin -> usr/bin
-I: user script /srv/workspace/pbuilder/7658/tmp/hooks/D02_print_environment finished
+  lrwxrwxrwx 1 root root 7 May  4 00:26 /bin -> usr/bin
+I: user script /srv/workspace/pbuilder/28394/tmp/hooks/D02_print_environment finished
  -> Attempting to satisfy build-dependencies
  -> Creating pbuilder-satisfydepends-dummy package
 Package: pbuilder-satisfydepends-dummy
@@ -2024,10 +2056,15 @@
 Reading package lists...
 Building dependency tree...
 Reading state information...
+usrmerge is already the newest version (35).
 fakeroot is already the newest version (1.31-1.2).
 0 upgraded, 0 newly installed, 0 to remove and 0 not upgraded.
 I: Building the package
-I: Running cd /build/junit4-4.13.2/ && env PATH="/usr/sbin:/usr/bin:/sbin:/bin:/usr/games" HOME="/nonexistent/first-build" dpkg-buildpackage -us -uc -b && env PATH="/usr/sbin:/usr/bin:/sbin:/bin:/usr/games" HOME="/nonexistent/first-build" dpkg-genchanges -S  > ../junit4_4.13.2-3_source.changes
+I: user script /srv/workspace/pbuilder/28394/tmp/hooks/A99_set_merged_usr starting
+Re-configuring usrmerge...
+I: user script /srv/workspace/pbuilder/28394/tmp/hooks/A99_set_merged_usr finished
+hostname: Temporary failure in name resolution
+I: Running cd /build/junit4-4.13.2/ && env PATH="/usr/sbin:/usr/bin:/sbin:/bin:/usr/games:/i/capture/the/path" HOME="/nonexistent/second-build" dpkg-buildpackage -us -uc -b && env PATH="/usr/sbin:/usr/bin:/sbin:/bin:/usr/games:/i/capture/the/path" HOME="/nonexistent/second-build" dpkg-genchanges -S  > ../junit4_4.13.2-3_source.changes
 dpkg-buildpackage: info: source package junit4
 dpkg-buildpackage: info: source version 4.13.2-3
 dpkg-buildpackage: info: source distribution unstable
@@ -2233,347 +2270,347 @@
 [WARNING] Loading source files for package junit.framework...
 [WARNING] Loading source files for package junit.extensions...
 [WARNING] [parsing started DirectoryFileObject[/build/junit4-4.13.2/src/main/java:org/junit/validator/ValidateWith.java]]
-[WARNING] [parsing completed 62ms]
+[WARNING] [parsing completed 39ms]
 [WARNING] [parsing started DirectoryFileObject[/build/junit4-4.13.2/src/main/java:org/junit/validator/TestClassValidator.java]]
-[WARNING] [parsing completed 13ms]
+[WARNING] [parsing completed 5ms]
 [WARNING] [parsing started DirectoryFileObject[/build/junit4-4.13.2/src/main/java:org/junit/validator/PublicClassValidator.java]]
-[WARNING] [parsing completed 25ms]
+[WARNING] [parsing completed 12ms]
 [WARNING] [parsing started DirectoryFileObject[/build/junit4-4.13.2/src/main/java:org/junit/validator/AnnotationsValidator.java]]
-[WARNING] [parsing completed 27ms]
+[WARNING] [parsing completed 19ms]
 [WARNING] [parsing started DirectoryFileObject[/build/junit4-4.13.2/src/main/java:org/junit/validator/AnnotationValidatorFactory.java]]
-[WARNING] [parsing completed 112ms]
+[WARNING] [parsing completed 28ms]
 [WARNING] [parsing started DirectoryFileObject[/build/junit4-4.13.2/src/main/java:org/junit/validator/AnnotationValidator.java]]
-[WARNING] [parsing completed 22ms]
+[WARNING] [parsing completed 14ms]
 [WARNING] [parsing started DirectoryFileObject[/build/junit4-4.13.2/src/main/java:org/junit/runners/parameterized/TestWithParameters.java]]
-[WARNING] [parsing completed 19ms]
+[WARNING] [parsing completed 11ms]
 [WARNING] [parsing started DirectoryFileObject[/build/junit4-4.13.2/src/main/java:org/junit/runners/parameterized/ParametersRunnerFactory.java]]
 [WARNING] [parsing completed 2ms]
 [WARNING] [parsing started DirectoryFileObject[/build/junit4-4.13.2/src/main/java:org/junit/runners/parameterized/BlockJUnit4ClassRunnerWithParametersFactory.java]]
-[WARNING] [parsing completed 10ms]
+[WARNING] [parsing completed 2ms]
 [WARNING] [parsing started DirectoryFileObject[/build/junit4-4.13.2/src/main/java:org/junit/runners/parameterized/BlockJUnit4ClassRunnerWithParameters.java]]
-[WARNING] [parsing completed 86ms]
+[WARNING] [parsing completed 46ms]
 [WARNING] [parsing started DirectoryFileObject[/build/junit4-4.13.2/src/main/java:org/junit/runners/package-info.java]]
 [WARNING] [parsing completed 1ms]
 [WARNING] [parsing started DirectoryFileObject[/build/junit4-4.13.2/src/main/java:org/junit/runners/Suite.java]]
-[WARNING] [parsing completed 37ms]
+[WARNING] [parsing completed 10ms]
 [WARNING] [parsing started DirectoryFileObject[/build/junit4-4.13.2/src/main/java:org/junit/runners/RuleContainer.java]]
-[WARNING] [parsing completed 13ms]
+[WARNING] [parsing completed 10ms]
 [WARNING] [parsing started DirectoryFileObject[/build/junit4-4.13.2/src/main/java:org/junit/runners/ParentRunner.java]]
-[WARNING] [parsing completed 106ms]
+[WARNING] [parsing completed 80ms]
 [WARNING] [parsing started DirectoryFileObject[/build/junit4-4.13.2/src/main/java:org/junit/runners/Parameterized.java]]
-[WARNING] [parsing completed 66ms]
+[WARNING] [parsing completed 43ms]
 [WARNING] [parsing started DirectoryFileObject[/build/junit4-4.13.2/src/main/java:org/junit/runners/MethodSorters.java]]
-[WARNING] [parsing completed 10ms]
+[WARNING] [parsing completed 5ms]
 [WARNING] [parsing started DirectoryFileObject[/build/junit4-4.13.2/src/main/java:org/junit/runners/JUnit4.java]]
-[WARNING] [parsing completed 10ms]
+[WARNING] [parsing completed 9ms]
 [WARNING] [parsing started DirectoryFileObject[/build/junit4-4.13.2/src/main/java:org/junit/runners/BlockJUnit4ClassRunner.java]]
-[WARNING] [parsing completed 70ms]
+[WARNING] [parsing completed 37ms]
 [WARNING] [parsing started DirectoryFileObject[/build/junit4-4.13.2/src/main/java:org/junit/runners/AllTests.java]]
-[WARNING] [parsing completed 6ms]
+[WARNING] [parsing completed 2ms]
 [WARNING] [parsing started DirectoryFileObject[/build/junit4-4.13.2/src/main/java:org/junit/runners/model/TestTimedOutException.java]]
-[WARNING] [parsing completed 8ms]
+[WARNING] [parsing completed 3ms]
 [WARNING] [parsing started DirectoryFileObject[/build/junit4-4.13.2/src/main/java:org/junit/runners/model/TestClass.java]]
-[WARNING] [parsing completed 38ms]
+[WARNING] [parsing completed 23ms]
 [WARNING] [parsing started DirectoryFileObject[/build/junit4-4.13.2/src/main/java:org/junit/runners/model/Statement.java]]
-[WARNING] [parsing completed 6ms]
+[WARNING] [parsing completed 1ms]
 [WARNING] [parsing started DirectoryFileObject[/build/junit4-4.13.2/src/main/java:org/junit/runners/model/RunnerScheduler.java]]
-[WARNING] [parsing completed 5ms]
+[WARNING] [parsing completed 1ms]
 [WARNING] [parsing started DirectoryFileObject[/build/junit4-4.13.2/src/main/java:org/junit/runners/model/RunnerBuilder.java]]
-[WARNING] [parsing completed 12ms]
+[WARNING] [parsing completed 6ms]
 [WARNING] [parsing started DirectoryFileObject[/build/junit4-4.13.2/src/main/java:org/junit/runners/model/NoGenericTypeParametersValidator.java]]
-[WARNING] [parsing completed 8ms]
+[WARNING] [parsing completed 4ms]
 [WARNING] [parsing started DirectoryFileObject[/build/junit4-4.13.2/src/main/java:org/junit/runners/model/MultipleFailureException.java]]
-[WARNING] [parsing completed 6ms]
+[WARNING] [parsing completed 4ms]
 [WARNING] [parsing started DirectoryFileObject[/build/junit4-4.13.2/src/main/java:org/junit/runners/model/MemberValueConsumer.java]]
 [WARNING] [parsing completed 1ms]
 [WARNING] [parsing started DirectoryFileObject[/build/junit4-4.13.2/src/main/java:org/junit/runners/model/InvalidTestClassError.java]]
-[WARNING] [parsing completed 7ms]
-[WARNING] [parsing started DirectoryFileObject[/build/junit4-4.13.2/src/main/java:org/junit/runners/model/InitializationError.java]]
 [WARNING] [parsing completed 3ms]
+[WARNING] [parsing started DirectoryFileObject[/build/junit4-4.13.2/src/main/java:org/junit/runners/model/InitializationError.java]]
+[WARNING] [parsing completed 2ms]
 [WARNING] [parsing started DirectoryFileObject[/build/junit4-4.13.2/src/main/java:org/junit/runners/model/FrameworkMethod.java]]
-[WARNING] [parsing completed 15ms]
+[WARNING] [parsing completed 11ms]
 [WARNING] [parsing started DirectoryFileObject[/build/junit4-4.13.2/src/main/java:org/junit/runners/model/FrameworkMember.java]]
-[WARNING] [parsing completed 8ms]
+[WARNING] [parsing completed 3ms]
 [WARNING] [parsing started DirectoryFileObject[/build/junit4-4.13.2/src/main/java:org/junit/runners/model/FrameworkField.java]]
-[WARNING] [parsing completed 9ms]
+[WARNING] [parsing completed 4ms]
 [WARNING] [parsing started DirectoryFileObject[/build/junit4-4.13.2/src/main/java:org/junit/runners/model/Annotatable.java]]
 [WARNING] [parsing completed 1ms]
 [WARNING] [parsing started DirectoryFileObject[/build/junit4-4.13.2/src/main/java:org/junit/runner/package-info.java]]
-[WARNING] [parsing completed 0ms]
-[WARNING] [parsing started DirectoryFileObject[/build/junit4-4.13.2/src/main/java:org/junit/runner/Runner.java]]
 [WARNING] [parsing completed 1ms]
+[WARNING] [parsing started DirectoryFileObject[/build/junit4-4.13.2/src/main/java:org/junit/runner/Runner.java]]
+[WARNING] [parsing completed 2ms]
 [WARNING] [parsing started DirectoryFileObject[/build/junit4-4.13.2/src/main/java:org/junit/runner/RunWith.java]]
 [WARNING] [parsing completed 1ms]
 [WARNING] [parsing started DirectoryFileObject[/build/junit4-4.13.2/src/main/java:org/junit/runner/Result.java]]
-[WARNING] [parsing completed 11ms]
+[WARNING] [parsing completed 10ms]
 [WARNING] [parsing started DirectoryFileObject[/build/junit4-4.13.2/src/main/java:org/junit/runner/Request.java]]
-[WARNING] [parsing completed 11ms]
+[WARNING] [parsing completed 6ms]
 [WARNING] [parsing started DirectoryFileObject[/build/junit4-4.13.2/src/main/java:org/junit/runner/OrderWithValidator.java]]
 [WARNING] [parsing completed 2ms]
 [WARNING] [parsing started DirectoryFileObject[/build/junit4-4.13.2/src/main/java:org/junit/runner/OrderWith.java]]
 [WARNING] [parsing completed 2ms]
 [WARNING] [parsing started DirectoryFileObject[/build/junit4-4.13.2/src/main/java:org/junit/runner/JUnitCore.java]]
-[WARNING] [parsing completed 9ms]
+[WARNING] [parsing completed 5ms]
 [WARNING] [parsing started DirectoryFileObject[/build/junit4-4.13.2/src/main/java:org/junit/runner/JUnitCommandLineParseResult.java]]
-[WARNING] [parsing completed 32ms]
+[WARNING] [parsing completed 8ms]
 [WARNING] [parsing started DirectoryFileObject[/build/junit4-4.13.2/src/main/java:org/junit/runner/FilterFactoryParams.java]]
-[WARNING] [parsing completed 5ms]
+[WARNING] [parsing completed 2ms]
 [WARNING] [parsing started DirectoryFileObject[/build/junit4-4.13.2/src/main/java:org/junit/runner/FilterFactory.java]]
 [WARNING] [parsing completed 1ms]
 [WARNING] [parsing started DirectoryFileObject[/build/junit4-4.13.2/src/main/java:org/junit/runner/FilterFactories.java]]
-[WARNING] [parsing completed 5ms]
+[WARNING] [parsing completed 4ms]
 [WARNING] [parsing started DirectoryFileObject[/build/junit4-4.13.2/src/main/java:org/junit/runner/Description.java]]
-[WARNING] [parsing completed 84ms]
+[WARNING] [parsing completed 29ms]
 [WARNING] [parsing started DirectoryFileObject[/build/junit4-4.13.2/src/main/java:org/junit/runner/Describable.java]]
-[WARNING] [parsing completed 1ms]
+[WARNING] [parsing completed 2ms]
 [WARNING] [parsing started DirectoryFileObject[/build/junit4-4.13.2/src/main/java:org/junit/runner/Computer.java]]
 [WARNING] [parsing completed 2ms]
 [WARNING] [parsing started DirectoryFileObject[/build/junit4-4.13.2/src/main/java:org/junit/runner/notification/package-info.java]]
 [WARNING] [parsing completed 1ms]
 [WARNING] [parsing started DirectoryFileObject[/build/junit4-4.13.2/src/main/java:org/junit/runner/notification/SynchronizedRunListener.java]]
-[WARNING] [parsing completed 9ms]
+[WARNING] [parsing completed 5ms]
 [WARNING] [parsing started DirectoryFileObject[/build/junit4-4.13.2/src/main/java:org/junit/runner/notification/StoppedByUserException.java]]
-[WARNING] [parsing completed 1ms]
+[WARNING] [parsing completed 2ms]
 [WARNING] [parsing started DirectoryFileObject[/build/junit4-4.13.2/src/main/java:org/junit/runner/notification/RunNotifier.java]]
-[WARNING] [parsing completed 23ms]
+[WARNING] [parsing completed 7ms]
 [WARNING] [parsing started DirectoryFileObject[/build/junit4-4.13.2/src/main/java:org/junit/runner/notification/RunListener.java]]
-[WARNING] [parsing completed 17ms]
+[WARNING] [parsing completed 4ms]
 [WARNING] [parsing started DirectoryFileObject[/build/junit4-4.13.2/src/main/java:org/junit/runner/notification/Failure.java]]
-[WARNING] [parsing completed 8ms]
+[WARNING] [parsing completed 2ms]
 [WARNING] [parsing started DirectoryFileObject[/build/junit4-4.13.2/src/main/java:org/junit/runner/manipulation/package-info.java]]
 [WARNING] [parsing completed 1ms]
 [WARNING] [parsing started DirectoryFileObject[/build/junit4-4.13.2/src/main/java:org/junit/runner/manipulation/Sorter.java]]
-[WARNING] [parsing completed 12ms]
+[WARNING] [parsing completed 3ms]
 [WARNING] [parsing started DirectoryFileObject[/build/junit4-4.13.2/src/main/java:org/junit/runner/manipulation/Sortable.java]]
-[WARNING] [parsing completed 1ms]
+[WARNING] [parsing completed 4ms]
 [WARNING] [parsing started DirectoryFileObject[/build/junit4-4.13.2/src/main/java:org/junit/runner/manipulation/Ordering.java]]
-[WARNING] [parsing completed 14ms]
+[WARNING] [parsing completed 6ms]
 [WARNING] [parsing started DirectoryFileObject[/build/junit4-4.13.2/src/main/java:org/junit/runner/manipulation/Orderer.java]]
-[WARNING] [parsing completed 11ms]
+[WARNING] [parsing completed 2ms]
 [WARNING] [parsing started DirectoryFileObject[/build/junit4-4.13.2/src/main/java:org/junit/runner/manipulation/Orderable.java]]
 [WARNING] [parsing completed 1ms]
 [WARNING] [parsing started DirectoryFileObject[/build/junit4-4.13.2/src/main/java:org/junit/runner/manipulation/NoTestsRemainException.java]]
-[WARNING] [parsing completed 1ms]
+[WARNING] [parsing completed 0ms]
 [WARNING] [parsing started DirectoryFileObject[/build/junit4-4.13.2/src/main/java:org/junit/runner/manipulation/InvalidOrderingException.java]]
 [WARNING] [parsing completed 1ms]
 [WARNING] [parsing started DirectoryFileObject[/build/junit4-4.13.2/src/main/java:org/junit/runner/manipulation/Filterable.java]]
-[WARNING] [parsing completed 3ms]
+[WARNING] [parsing completed 1ms]
 [WARNING] [parsing started DirectoryFileObject[/build/junit4-4.13.2/src/main/java:org/junit/runner/manipulation/Filter.java]]
-[WARNING] [parsing completed 4ms]
+[WARNING] [parsing completed 5ms]
 [WARNING] [parsing started DirectoryFileObject[/build/junit4-4.13.2/src/main/java:org/junit/runner/manipulation/Alphanumeric.java]]
-[WARNING] [parsing completed 2ms]
+[WARNING] [parsing completed 1ms]
 [WARNING] [parsing started DirectoryFileObject[/build/junit4-4.13.2/src/main/java:org/junit/rules/Verifier.java]]
-[WARNING] [parsing completed 2ms]
+[WARNING] [parsing completed 1ms]
 [WARNING] [parsing started DirectoryFileObject[/build/junit4-4.13.2/src/main/java:org/junit/rules/Timeout.java]]
-[WARNING] [parsing completed 14ms]
+[WARNING] [parsing completed 7ms]
 [WARNING] [parsing started DirectoryFileObject[/build/junit4-4.13.2/src/main/java:org/junit/rules/TestWatchman.java]]
-[WARNING] [parsing completed 10ms]
+[WARNING] [parsing completed 3ms]
 [WARNING] [parsing started DirectoryFileObject[/build/junit4-4.13.2/src/main/java:org/junit/rules/TestWatcher.java]]
-[WARNING] [parsing completed 23ms]
-[WARNING] [parsing started DirectoryFileObject[/build/junit4-4.13.2/src/main/java:org/junit/rules/TestRule.java]]
 [WARNING] [parsing completed 6ms]
+[WARNING] [parsing started DirectoryFileObject[/build/junit4-4.13.2/src/main/java:org/junit/rules/TestRule.java]]
+[WARNING] [parsing completed 2ms]
 [WARNING] [parsing started DirectoryFileObject[/build/junit4-4.13.2/src/main/java:org/junit/rules/TestName.java]]
-[WARNING] [parsing completed 10ms]
+[WARNING] [parsing completed 1ms]
 [WARNING] [parsing started DirectoryFileObject[/build/junit4-4.13.2/src/main/java:org/junit/rules/TemporaryFolder.java]]
-[WARNING] [parsing completed 50ms]
+[WARNING] [parsing completed 16ms]
 [WARNING] [parsing started DirectoryFileObject[/build/junit4-4.13.2/src/main/java:org/junit/rules/Stopwatch.java]]
-[WARNING] [parsing completed 5ms]
+[WARNING] [parsing completed 6ms]
 [WARNING] [parsing started DirectoryFileObject[/build/junit4-4.13.2/src/main/java:org/junit/rules/RunRules.java]]
-[WARNING] [parsing completed 10ms]
+[WARNING] [parsing completed 2ms]
 [WARNING] [parsing started DirectoryFileObject[/build/junit4-4.13.2/src/main/java:org/junit/rules/RuleChain.java]]
-[WARNING] [parsing completed 8ms]
+[WARNING] [parsing completed 3ms]
 [WARNING] [parsing started DirectoryFileObject[/build/junit4-4.13.2/src/main/java:org/junit/rules/MethodRule.java]]
-[WARNING] [parsing completed 2ms]
+[WARNING] [parsing completed 1ms]
 [WARNING] [parsing started DirectoryFileObject[/build/junit4-4.13.2/src/main/java:org/junit/rules/ExternalResource.java]]
-[WARNING] [parsing completed 4ms]
+[WARNING] [parsing completed 2ms]
 [WARNING] [parsing started DirectoryFileObject[/build/junit4-4.13.2/src/main/java:org/junit/rules/ExpectedExceptionMatcherBuilder.java]]
-[WARNING] [parsing completed 4ms]
+[WARNING] [parsing completed 2ms]
 [WARNING] [parsing started DirectoryFileObject[/build/junit4-4.13.2/src/main/java:org/junit/rules/ExpectedException.java]]
-[WARNING] [parsing completed 8ms]
+[WARNING] [parsing completed 6ms]
 [WARNING] [parsing started DirectoryFileObject[/build/junit4-4.13.2/src/main/java:org/junit/rules/ErrorCollector.java]]
-[WARNING] [parsing completed 7ms]
+[WARNING] [parsing completed 5ms]
 [WARNING] [parsing started DirectoryFileObject[/build/junit4-4.13.2/src/main/java:org/junit/rules/DisableOnDebug.java]]
-[WARNING] [parsing completed 4ms]
+[WARNING] [parsing completed 3ms]
 [WARNING] [parsing started DirectoryFileObject[/build/junit4-4.13.2/src/main/java:org/junit/package-info.java]]
-[WARNING] [parsing completed 1ms]
+[WARNING] [parsing completed 0ms]
 [WARNING] [parsing started DirectoryFileObject[/build/junit4-4.13.2/src/main/java:org/junit/TestCouldNotBeSkippedException.java]]
-[WARNING] [parsing completed 2ms]
+[WARNING] [parsing completed 1ms]
 [WARNING] [parsing started DirectoryFileObject[/build/junit4-4.13.2/src/main/java:org/junit/Test.java]]
-[WARNING] [parsing completed 6ms]
+[WARNING] [parsing completed 3ms]
 [WARNING] [parsing started DirectoryFileObject[/build/junit4-4.13.2/src/main/java:org/junit/Rule.java]]
 [WARNING] [parsing completed 2ms]
 [WARNING] [parsing started DirectoryFileObject[/build/junit4-4.13.2/src/main/java:org/junit/Ignore.java]]
-[WARNING] [parsing completed 5ms]
-[WARNING] [parsing started DirectoryFileObject[/build/junit4-4.13.2/src/main/java:org/junit/FixMethodOrder.java]]
 [WARNING] [parsing completed 2ms]
+[WARNING] [parsing started DirectoryFileObject[/build/junit4-4.13.2/src/main/java:org/junit/FixMethodOrder.java]]
+[WARNING] [parsing completed 1ms]
 [WARNING] [parsing started DirectoryFileObject[/build/junit4-4.13.2/src/main/java:org/junit/ComparisonFailure.java]]
-[WARNING] [parsing completed 9ms]
+[WARNING] [parsing completed 5ms]
 [WARNING] [parsing started DirectoryFileObject[/build/junit4-4.13.2/src/main/java:org/junit/ClassRule.java]]
-[WARNING] [parsing completed 3ms]
+[WARNING] [parsing completed 2ms]
 [WARNING] [parsing started DirectoryFileObject[/build/junit4-4.13.2/src/main/java:org/junit/BeforeClass.java]]
 [WARNING] [parsing completed 1ms]
 [WARNING] [parsing started DirectoryFileObject[/build/junit4-4.13.2/src/main/java:org/junit/Before.java]]
-[WARNING] [parsing completed 3ms]
+[WARNING] [parsing completed 1ms]
 [WARNING] [parsing started DirectoryFileObject[/build/junit4-4.13.2/src/main/java:org/junit/AssumptionViolatedException.java]]
 [WARNING] [parsing completed 2ms]
 [WARNING] [parsing started DirectoryFileObject[/build/junit4-4.13.2/src/main/java:org/junit/Assume.java]]
-[WARNING] [parsing completed 5ms]
+[WARNING] [parsing completed 3ms]
 [WARNING] [parsing started DirectoryFileObject[/build/junit4-4.13.2/src/main/java:org/junit/Assert.java]]
-[WARNING] [parsing completed 62ms]
+[WARNING] [parsing completed 23ms]
 [WARNING] [parsing started DirectoryFileObject[/build/junit4-4.13.2/src/main/java:org/junit/AfterClass.java]]
 [WARNING] [parsing completed 1ms]
 [WARNING] [parsing started DirectoryFileObject[/build/junit4-4.13.2/src/main/java:org/junit/After.java]]
-[WARNING] [parsing completed 3ms]
+[WARNING] [parsing completed 1ms]
 [WARNING] [parsing started DirectoryFileObject[/build/junit4-4.13.2/src/main/java:org/junit/matchers/JUnitMatchers.java]]
-[WARNING] [parsing completed 6ms]
+[WARNING] [parsing completed 3ms]
 [WARNING] [parsing started DirectoryFileObject[/build/junit4-4.13.2/src/main/java:org/junit/matchers/package-info.java]]
 [WARNING] [parsing completed 0ms]
 [WARNING] [parsing started DirectoryFileObject[/build/junit4-4.13.2/src/main/java:org/junit/internal/Throwables.java]]
-[WARNING] [parsing completed 17ms]
+[WARNING] [parsing completed 10ms]
 [WARNING] [parsing started DirectoryFileObject[/build/junit4-4.13.2/src/main/java:org/junit/internal/TextListener.java]]
-[WARNING] [parsing completed 8ms]
+[WARNING] [parsing completed 4ms]
 [WARNING] [parsing started DirectoryFileObject[/build/junit4-4.13.2/src/main/java:org/junit/internal/SerializableValueDescription.java]]
-[WARNING] [parsing completed 1ms]
+[WARNING] [parsing completed 2ms]
 [WARNING] [parsing started DirectoryFileObject[/build/junit4-4.13.2/src/main/java:org/junit/internal/SerializableMatcherDescription.java]]
 [WARNING] [parsing completed 2ms]
 [WARNING] [parsing started DirectoryFileObject[/build/junit4-4.13.2/src/main/java:org/junit/internal/RealSystem.java]]
-[WARNING] [parsing completed 5ms]
+[WARNING] [parsing completed 0ms]
 [WARNING] [parsing started DirectoryFileObject[/build/junit4-4.13.2/src/main/java:org/junit/internal/MethodSorter.java]]
 [WARNING] [parsing completed 3ms]
 [WARNING] [parsing started DirectoryFileObject[/build/junit4-4.13.2/src/main/java:org/junit/internal/JUnitSystem.java]]
 [WARNING] [parsing completed 1ms]
 [WARNING] [parsing started DirectoryFileObject[/build/junit4-4.13.2/src/main/java:org/junit/internal/InexactComparisonCriteria.java]]
-[WARNING] [parsing completed 3ms]
+[WARNING] [parsing completed 1ms]
 [WARNING] [parsing started DirectoryFileObject[/build/junit4-4.13.2/src/main/java:org/junit/internal/ExactComparisonCriteria.java]]
-[WARNING] [parsing completed 0ms]
+[WARNING] [parsing completed 1ms]
 [WARNING] [parsing started DirectoryFileObject[/build/junit4-4.13.2/src/main/java:org/junit/internal/ComparisonCriteria.java]]
-[WARNING] [parsing completed 27ms]
+[WARNING] [parsing completed 4ms]
 [WARNING] [parsing started DirectoryFileObject[/build/junit4-4.13.2/src/main/java:org/junit/internal/Classes.java]]
 [WARNING] [parsing completed 2ms]
 [WARNING] [parsing started DirectoryFileObject[/build/junit4-4.13.2/src/main/java:org/junit/internal/Checks.java]]
 [WARNING] [parsing completed 1ms]
 [WARNING] [parsing started DirectoryFileObject[/build/junit4-4.13.2/src/main/java:org/junit/internal/AssumptionViolatedException.java]]
-[WARNING] [parsing completed 5ms]
+[WARNING] [parsing completed 3ms]
 [WARNING] [parsing started DirectoryFileObject[/build/junit4-4.13.2/src/main/java:org/junit/internal/ArrayComparisonFailure.java]]
-[WARNING] [parsing completed 7ms]
+[WARNING] [parsing completed 2ms]
 [WARNING] [parsing started DirectoryFileObject[/build/junit4-4.13.2/src/main/java:org/junit/function/ThrowingRunnable.java]]
-[WARNING] [parsing completed 1ms]
+[WARNING] [parsing completed 0ms]
 [WARNING] [parsing started DirectoryFileObject[/build/junit4-4.13.2/src/main/java:org/junit/experimental/theories/suppliers/TestedOnSupplier.java]]
 [WARNING] [parsing completed 1ms]
 [WARNING] [parsing started DirectoryFileObject[/build/junit4-4.13.2/src/main/java:org/junit/experimental/theories/suppliers/TestedOn.java]]
-[WARNING] [parsing completed 1ms]
+[WARNING] [parsing completed 0ms]
 [WARNING] [parsing started DirectoryFileObject[/build/junit4-4.13.2/src/main/java:org/junit/experimental/theories/internal/SpecificDataPointsSupplier.java]]
-[WARNING] [parsing completed 4ms]
+[WARNING] [parsing completed 2ms]
 [WARNING] [parsing started DirectoryFileObject[/build/junit4-4.13.2/src/main/java:org/junit/experimental/theories/internal/ParameterizedAssertionError.java]]
-[WARNING] [parsing completed 6ms]
-[WARNING] [parsing started DirectoryFileObject[/build/junit4-4.13.2/src/main/java:org/junit/experimental/theories/internal/EnumSupplier.java]]
 [WARNING] [parsing completed 2ms]
+[WARNING] [parsing started DirectoryFileObject[/build/junit4-4.13.2/src/main/java:org/junit/experimental/theories/internal/EnumSupplier.java]]
+[WARNING] [parsing completed 1ms]
 [WARNING] [parsing started DirectoryFileObject[/build/junit4-4.13.2/src/main/java:org/junit/experimental/theories/internal/BooleanSupplier.java]]
 [WARNING] [parsing completed 1ms]
 [WARNING] [parsing started DirectoryFileObject[/build/junit4-4.13.2/src/main/java:org/junit/experimental/theories/internal/Assignments.java]]
-[WARNING] [parsing completed 11ms]
+[WARNING] [parsing completed 5ms]
 [WARNING] [parsing started DirectoryFileObject[/build/junit4-4.13.2/src/main/java:org/junit/experimental/theories/internal/AllMembersSupplier.java]]
-[WARNING] [parsing completed 14ms]
+[WARNING] [parsing completed 5ms]
 [WARNING] [parsing started DirectoryFileObject[/build/junit4-4.13.2/src/main/java:org/junit/experimental/theories/Theory.java]]
 [WARNING] [parsing completed 1ms]
 [WARNING] [parsing started DirectoryFileObject[/build/junit4-4.13.2/src/main/java:org/junit/experimental/theories/Theories.java]]
-[WARNING] [parsing completed 31ms]
+[WARNING] [parsing completed 7ms]
 [WARNING] [parsing started DirectoryFileObject[/build/junit4-4.13.2/src/main/java:org/junit/experimental/theories/PotentialAssignment.java]]
-[WARNING] [parsing completed 3ms]
+[WARNING] [parsing completed 2ms]
 [WARNING] [parsing started DirectoryFileObject[/build/junit4-4.13.2/src/main/java:org/junit/experimental/theories/ParametersSuppliedBy.java]]
-[WARNING] [parsing completed 15ms]
+[WARNING] [parsing completed 1ms]
 [WARNING] [parsing started DirectoryFileObject[/build/junit4-4.13.2/src/main/java:org/junit/experimental/theories/ParameterSupplier.java]]
-[WARNING] [parsing completed 14ms]
+[WARNING] [parsing completed 1ms]
 [WARNING] [parsing started DirectoryFileObject[/build/junit4-4.13.2/src/main/java:org/junit/experimental/theories/ParameterSignature.java]]
-[WARNING] [parsing completed 21ms]
+[WARNING] [parsing completed 4ms]
 [WARNING] [parsing started DirectoryFileObject[/build/junit4-4.13.2/src/main/java:org/junit/experimental/theories/FromDataPoints.java]]
-[WARNING] [parsing completed 2ms]
+[WARNING] [parsing completed 1ms]
 [WARNING] [parsing started DirectoryFileObject[/build/junit4-4.13.2/src/main/java:org/junit/experimental/theories/DataPoints.java]]
-[WARNING] [parsing completed 11ms]
+[WARNING] [parsing completed 1ms]
 [WARNING] [parsing started DirectoryFileObject[/build/junit4-4.13.2/src/main/java:org/junit/experimental/theories/DataPoint.java]]
-[WARNING] [parsing completed 7ms]
+[WARNING] [parsing completed 1ms]
 [WARNING] [parsing started DirectoryFileObject[/build/junit4-4.13.2/src/main/java:org/junit/experimental/runners/Enclosed.java]]
-[WARNING] [parsing completed 14ms]
+[WARNING] [parsing completed 1ms]
 [WARNING] [parsing started DirectoryFileObject[/build/junit4-4.13.2/src/main/java:org/junit/experimental/results/ResultMatchers.java]]
-[WARNING] [parsing completed 4ms]
-[WARNING] [parsing started DirectoryFileObject[/build/junit4-4.13.2/src/main/java:org/junit/experimental/results/PrintableResult.java]]
 [WARNING] [parsing completed 3ms]
+[WARNING] [parsing started DirectoryFileObject[/build/junit4-4.13.2/src/main/java:org/junit/experimental/results/PrintableResult.java]]
+[WARNING] [parsing completed 1ms]
 [WARNING] [parsing started DirectoryFileObject[/build/junit4-4.13.2/src/main/java:org/junit/experimental/results/FailureList.java]]
-[WARNING] [parsing completed 2ms]
+[WARNING] [parsing completed 0ms]
 [WARNING] [parsing started DirectoryFileObject[/build/junit4-4.13.2/src/main/java:org/junit/experimental/max/MaxHistory.java]]
-[WARNING] [parsing completed 24ms]
+[WARNING] [parsing completed 4ms]
 [WARNING] [parsing started DirectoryFileObject[/build/junit4-4.13.2/src/main/java:org/junit/experimental/max/MaxCore.java]]
-[WARNING] [parsing completed 6ms]
+[WARNING] [parsing completed 4ms]
 [WARNING] [parsing started DirectoryFileObject[/build/junit4-4.13.2/src/main/java:org/junit/experimental/max/CouldNotReadCoreException.java]]
-[WARNING] [parsing completed 1ms]
+[WARNING] [parsing completed 0ms]
 [WARNING] [parsing started DirectoryFileObject[/build/junit4-4.13.2/src/main/java:org/junit/experimental/categories/IncludeCategories.java]]
-[WARNING] [parsing completed 2ms]
+[WARNING] [parsing completed 1ms]
 [WARNING] [parsing started DirectoryFileObject[/build/junit4-4.13.2/src/main/java:org/junit/experimental/categories/ExcludeCategories.java]]
-[WARNING] [parsing completed 2ms]
+[WARNING] [parsing completed 1ms]
 [WARNING] [parsing started DirectoryFileObject[/build/junit4-4.13.2/src/main/java:org/junit/experimental/categories/CategoryValidator.java]]
-[WARNING] [parsing completed 7ms]
+[WARNING] [parsing completed 1ms]
 [WARNING] [parsing started DirectoryFileObject[/build/junit4-4.13.2/src/main/java:org/junit/experimental/categories/CategoryFilterFactory.java]]
-[WARNING] [parsing completed 2ms]
-[WARNING] [parsing started DirectoryFileObject[/build/junit4-4.13.2/src/main/java:org/junit/experimental/categories/Category.java]]
 [WARNING] [parsing completed 1ms]
+[WARNING] [parsing started DirectoryFileObject[/build/junit4-4.13.2/src/main/java:org/junit/experimental/categories/Category.java]]
+[WARNING] [parsing completed 0ms]
 [WARNING] [parsing started DirectoryFileObject[/build/junit4-4.13.2/src/main/java:org/junit/experimental/categories/Categories.java]]
-[WARNING] [parsing completed 16ms]
-[WARNING] [parsing started DirectoryFileObject[/build/junit4-4.13.2/src/main/java:org/junit/experimental/ParallelComputer.java]]
 [WARNING] [parsing completed 7ms]
+[WARNING] [parsing started DirectoryFileObject[/build/junit4-4.13.2/src/main/java:org/junit/experimental/ParallelComputer.java]]
+[WARNING] [parsing completed 2ms]
 [WARNING] [parsing started DirectoryFileObject[/build/junit4-4.13.2/src/main/java:junit/textui/package-info.java]]
-[WARNING] [parsing completed 0ms]
+[WARNING] [parsing completed 1ms]
 [WARNING] [parsing started DirectoryFileObject[/build/junit4-4.13.2/src/main/java:junit/textui/TestRunner.java]]
-[WARNING] [parsing completed 7ms]
+[WARNING] [parsing completed 6ms]
 [WARNING] [parsing started DirectoryFileObject[/build/junit4-4.13.2/src/main/java:junit/textui/ResultPrinter.java]]
-[WARNING] [parsing completed 9ms]
+[WARNING] [parsing completed 3ms]
 [WARNING] [parsing started DirectoryFileObject[/build/junit4-4.13.2/src/main/java:junit/runner/Version.java]]
-[WARNING] [parsing completed 1ms]
+[WARNING] [parsing completed 0ms]
 [WARNING] [parsing started DirectoryFileObject[/build/junit4-4.13.2/src/main/java:junit/runner/package-info.java]]
-[WARNING] [parsing completed 1ms]
+[WARNING] [parsing completed 0ms]
 [WARNING] [parsing started DirectoryFileObject[/build/junit4-4.13.2/src/main/java:junit/runner/TestRunListener.java]]
-[WARNING] [parsing completed 5ms]
+[WARNING] [parsing completed 1ms]
 [WARNING] [parsing started DirectoryFileObject[/build/junit4-4.13.2/src/main/java:junit/runner/BaseTestRunner.java]]
-[WARNING] [parsing completed 19ms]
+[WARNING] [parsing completed 6ms]
 [WARNING] [parsing started DirectoryFileObject[/build/junit4-4.13.2/src/main/java:junit/framework/package-info.java]]
-[WARNING] [parsing completed 1ms]
+[WARNING] [parsing completed 0ms]
 [WARNING] [parsing started DirectoryFileObject[/build/junit4-4.13.2/src/main/java:junit/framework/TestSuite.java]]
-[WARNING] [parsing completed 31ms]
+[WARNING] [parsing completed 13ms]
 [WARNING] [parsing started DirectoryFileObject[/build/junit4-4.13.2/src/main/java:junit/framework/TestResult.java]]
-[WARNING] [parsing completed 6ms]
+[WARNING] [parsing completed 3ms]
 [WARNING] [parsing started DirectoryFileObject[/build/junit4-4.13.2/src/main/java:junit/framework/TestListener.java]]
-[WARNING] [parsing completed 0ms]
+[WARNING] [parsing completed 1ms]
 [WARNING] [parsing started DirectoryFileObject[/build/junit4-4.13.2/src/main/java:junit/framework/TestFailure.java]]
-[WARNING] [parsing completed 6ms]
+[WARNING] [parsing completed 1ms]
 [WARNING] [parsing started DirectoryFileObject[/build/junit4-4.13.2/src/main/java:junit/framework/TestCase.java]]
-[WARNING] [parsing completed 16ms]
+[WARNING] [parsing completed 7ms]
 [WARNING] [parsing started DirectoryFileObject[/build/junit4-4.13.2/src/main/java:junit/framework/Test.java]]
-[WARNING] [parsing completed 5ms]
+[WARNING] [parsing completed 1ms]
 [WARNING] [parsing started DirectoryFileObject[/build/junit4-4.13.2/src/main/java:junit/framework/Protectable.java]]
 [WARNING] [parsing completed 1ms]
 [WARNING] [parsing started DirectoryFileObject[/build/junit4-4.13.2/src/main/java:junit/framework/JUnit4TestCaseFacade.java]]
 [WARNING] [parsing completed 1ms]
 [WARNING] [parsing started DirectoryFileObject[/build/junit4-4.13.2/src/main/java:junit/framework/JUnit4TestAdapterCache.java]]
-[WARNING] [parsing completed 3ms]
+[WARNING] [parsing completed 1ms]
 [WARNING] [parsing started DirectoryFileObject[/build/junit4-4.13.2/src/main/java:junit/framework/JUnit4TestAdapter.java]]
-[WARNING] [parsing completed 3ms]
-[WARNING] [parsing started DirectoryFileObject[/build/junit4-4.13.2/src/main/java:junit/framework/ComparisonFailure.java]]
 [WARNING] [parsing completed 2ms]
+[WARNING] [parsing started DirectoryFileObject[/build/junit4-4.13.2/src/main/java:junit/framework/ComparisonFailure.java]]
+[WARNING] [parsing completed 1ms]
 [WARNING] [parsing started DirectoryFileObject[/build/junit4-4.13.2/src/main/java:junit/framework/ComparisonCompactor.java]]
-[WARNING] [parsing completed 4ms]
-[WARNING] [parsing started DirectoryFileObject[/build/junit4-4.13.2/src/main/java:junit/framework/AssertionFailedError.java]]
 [WARNING] [parsing completed 2ms]
+[WARNING] [parsing started DirectoryFileObject[/build/junit4-4.13.2/src/main/java:junit/framework/AssertionFailedError.java]]
+[WARNING] [parsing completed 1ms]
 [WARNING] [parsing started DirectoryFileObject[/build/junit4-4.13.2/src/main/java:junit/framework/Assert.java]]
-[WARNING] [parsing completed 10ms]
+[WARNING] [parsing completed 6ms]
 [WARNING] [parsing started DirectoryFileObject[/build/junit4-4.13.2/src/main/java:junit/extensions/package-info.java]]
-[WARNING] [parsing completed 0ms]
+[WARNING] [parsing completed 1ms]
 [WARNING] [parsing started DirectoryFileObject[/build/junit4-4.13.2/src/main/java:junit/extensions/TestSetup.java]]
 [WARNING] [parsing completed 1ms]
 [WARNING] [parsing started DirectoryFileObject[/build/junit4-4.13.2/src/main/java:junit/extensions/TestDecorator.java]]
-[WARNING] [parsing completed 2ms]
+[WARNING] [parsing completed 1ms]
 [WARNING] [parsing started DirectoryFileObject[/build/junit4-4.13.2/src/main/java:junit/extensions/RepeatedTest.java]]
-[WARNING] [parsing completed 7ms]
+[WARNING] [parsing completed 1ms]
 [WARNING] [parsing started DirectoryFileObject[/build/junit4-4.13.2/src/main/java:junit/extensions/ActiveTestSuite.java]]
-[WARNING] [parsing completed 2ms]
+[WARNING] [parsing completed 1ms]
 [WARNING] Constructing Javadoc information...
 [WARNING] [search path for source files: /build/junit4-4.13.2/src/main/java,/build/junit4-4.13.2/target/generated-sources/annotations,/build/junit4-4.13.2/src/main/javadoc]
 [WARNING] [search path for class files: /usr/lib/jvm/java-17-openjdk-arm64/lib/modules,/build/junit4-4.13.2/debian/maven-repo/org/hamcrest/hamcrest/debian/hamcrest-debian.jar]
@@ -2603,7 +2640,7 @@
 [WARNING] [loading /89A/java.base/java/lang/reflect/Type.sig]
 [WARNING] [loading /build/junit4-4.13.2/src/main/java/org/junit/internal/runners/model/ReflectiveCallable.java]
 [WARNING] [parsing started DirectoryFileObject[/build/junit4-4.13.2/src/main/java:org/junit/internal/runners/model/ReflectiveCallable.java]]
-[WARNING] [parsing completed 2ms]
+[WARNING] [parsing completed 1ms]
 [WARNING] [loading /879ABCDEFG/java.base/java/lang/Throwable.sig]
 [WARNING] [loading /8/java.base/java/lang/String.sig]
 [WARNING] [loading /879A/java.base/java/lang/IllegalArgumentException.sig]
@@ -2638,7 +2675,7 @@
 [WARNING] [loading /87/java.base/java/text/MessageFormat.sig]
 [WARNING] [loading /build/junit4-4.13.2/src/main/java/org/junit/internal/runners/rules/RuleMemberValidator.java]
 [WARNING] [parsing started DirectoryFileObject[/build/junit4-4.13.2/src/main/java:org/junit/internal/runners/rules/RuleMemberValidator.java]]
-[WARNING] [parsing completed 10ms]
+[WARNING] [parsing completed 6ms]
 [WARNING] [loading /8/java.base/java/util/concurrent/ConcurrentMap.sig]
 [WARNING] [loading /87/java.base/java/util/concurrent/TimeUnit.sig]
 [WARNING] [loading /build/junit4-4.13.2/src/main/java/org/junit/internal/runners/statements/ExpectException.java]
@@ -2649,7 +2686,7 @@
 [WARNING] [parsing completed 0ms]
 [WARNING] [loading /build/junit4-4.13.2/src/main/java/org/junit/internal/runners/statements/FailOnTimeout.java]
 [WARNING] [parsing started DirectoryFileObject[/build/junit4-4.13.2/src/main/java:org/junit/internal/runners/statements/FailOnTimeout.java]]
-[WARNING] [parsing completed 14ms]
+[WARNING] [parsing completed 6ms]
 [WARNING] [loading /build/junit4-4.13.2/src/main/java/org/junit/internal/runners/statements/InvokeMethod.java]
 [WARNING] [parsing started DirectoryFileObject[/build/junit4-4.13.2/src/main/java:org/junit/internal/runners/statements/InvokeMethod.java]]
 [WARNING] [parsing completed 1ms]
@@ -2671,17 +2708,17 @@
 [WARNING] [loading /879A/java.base/java/lang/InstantiationException.sig]
 [WARNING] [loading /build/junit4-4.13.2/src/main/java/org/junit/internal/runners/ErrorReportingRunner.java]
 [WARNING] [parsing started DirectoryFileObject[/build/junit4-4.13.2/src/main/java:org/junit/internal/runners/ErrorReportingRunner.java]]
-[WARNING] [parsing completed 10ms]
+[WARNING] [parsing completed 2ms]
 [WARNING] [loading /build/junit4-4.13.2/debian/maven-repo/org/hamcrest/hamcrest/debian/hamcrest-debian.jar(/org/hamcrest/Description.class)]
 [WARNING] [loading /build/junit4-4.13.2/debian/maven-repo/org/hamcrest/hamcrest/debian/hamcrest-debian.jar(/org/hamcrest/Matcher.class)]
 [WARNING] [loading /build/junit4-4.13.2/debian/maven-repo/org/hamcrest/hamcrest/debian/hamcrest-debian.jar(/org/hamcrest/SelfDescribing.class)]
 [WARNING] [loading /build/junit4-4.13.2/debian/maven-repo/org/hamcrest/hamcrest/debian/hamcrest-debian.jar(/org/hamcrest/StringDescription.class)]
 [WARNING] [loading /build/junit4-4.13.2/src/main/java/org/junit/internal/runners/SuiteMethod.java]
 [WARNING] [parsing started DirectoryFileObject[/build/junit4-4.13.2/src/main/java:org/junit/internal/runners/SuiteMethod.java]]
-[WARNING] [parsing completed 1ms]
+[WARNING] [parsing completed 2ms]
 [WARNING] [loading /build/junit4-4.13.2/src/main/java/org/junit/internal/runners/JUnit38ClassRunner.java]
 [WARNING] [parsing started DirectoryFileObject[/build/junit4-4.13.2/src/main/java:org/junit/internal/runners/JUnit38ClassRunner.java]]
-[WARNING] [parsing completed 5ms]
+[WARNING] [parsing completed 3ms]
 [WARNING] [loading /87/java.base/java/util/Enumeration.sig]
 [WARNING] [loading /879A/java.base/java/lang/AssertionError.sig]
 [WARNING] [loading /879A/java.base/java/lang/Error.sig]
@@ -2706,7 +2743,7 @@
 [WARNING] [parsing completed 1ms]
 [WARNING] [loading /build/junit4-4.13.2/src/main/java/org/junit/internal/requests/SortingRequest.java]
 [WARNING] [parsing started DirectoryFileObject[/build/junit4-4.13.2/src/main/java:org/junit/internal/requests/SortingRequest.java]]
-[WARNING] [parsing completed 1ms]
+[WARNING] [parsing completed 0ms]
 [WARNING] [loading /build/junit4-4.13.2/debian/maven-repo/org/hamcrest/hamcrest/debian/hamcrest-debian.jar(/org/hamcrest/MatcherAssert.class)]
 [WARNING] [loading /87/java.base/java/io/File.sig]
 [WARNING] [loading /87/java.base/java/lang/reflect/Array.sig]
@@ -2716,10 +2753,10 @@
 [WARNING] [loading /build/junit4-4.13.2/debian/maven-repo/org/hamcrest/hamcrest/debian/hamcrest-debian.jar(/org/hamcrest/core/CombinableMatcher$CombinableEitherMatcher.class)]
 [WARNING] [loading /build/junit4-4.13.2/src/main/java/org/junit/internal/matchers/StacktracePrintingMatcher.java]
 [WARNING] [parsing started DirectoryFileObject[/build/junit4-4.13.2/src/main/java:org/junit/internal/matchers/StacktracePrintingMatcher.java]]
-[WARNING] [parsing completed 2ms]
+[WARNING] [parsing completed 1ms]
 [WARNING] [loading /build/junit4-4.13.2/src/main/java/org/junit/internal/matchers/ThrowableCauseMatcher.java]
 [WARNING] [parsing started DirectoryFileObject[/build/junit4-4.13.2/src/main/java:org/junit/internal/matchers/ThrowableCauseMatcher.java]]
-[WARNING] [parsing completed 2ms]
+[WARNING] [parsing completed 1ms]
 [WARNING] [loading /build/junit4-4.13.2/debian/maven-repo/org/hamcrest/hamcrest/debian/hamcrest-debian.jar(/org/hamcrest/Factory.class)]
 [WARNING] [loading /build/junit4-4.13.2/debian/maven-repo/org/hamcrest/hamcrest/debian/hamcrest-debian.jar(/org/hamcrest/TypeSafeMatcher.class)]
 [WARNING] [loading /build/junit4-4.13.2/src/main/java/org/junit/internal/matchers/ThrowableMessageMatcher.java]
@@ -2730,7 +2767,7 @@
 [WARNING] [loading /89A/java.base/java/util/concurrent/Callable.sig]
 [WARNING] [loading /build/junit4-4.13.2/src/main/java/org/junit/internal/management/ManagementFactory.java]
 [WARNING] [parsing started DirectoryFileObject[/build/junit4-4.13.2/src/main/java:org/junit/internal/management/ManagementFactory.java]]
-[WARNING] [parsing completed 3ms]
+[WARNING] [parsing completed 2ms]
 [WARNING] [loading /build/junit4-4.13.2/src/main/java/org/junit/internal/management/RuntimeMXBean.java]
 [WARNING] [parsing started DirectoryFileObject[/build/junit4-4.13.2/src/main/java:org/junit/internal/management/RuntimeMXBean.java]]
 [WARNING] [parsing completed 0ms]
@@ -2767,16 +2804,16 @@
 [WARNING] [parsing completed 0ms]
 [WARNING] [loading /build/junit4-4.13.2/src/main/java/org/junit/internal/builders/JUnit3Builder.java]
 [WARNING] [parsing started DirectoryFileObject[/build/junit4-4.13.2/src/main/java:org/junit/internal/builders/JUnit3Builder.java]]
-[WARNING] [parsing completed 1ms]
+[WARNING] [parsing completed 0ms]
 [WARNING] [loading /build/junit4-4.13.2/src/main/java/org/junit/internal/builders/AnnotatedBuilder.java]
 [WARNING] [parsing started DirectoryFileObject[/build/junit4-4.13.2/src/main/java:org/junit/internal/builders/AnnotatedBuilder.java]]
-[WARNING] [parsing completed 5ms]
+[WARNING] [parsing completed 1ms]
 [WARNING] [loading /build/junit4-4.13.2/src/main/java/org/junit/internal/builders/IgnoredBuilder.java]
 [WARNING] [parsing started DirectoryFileObject[/build/junit4-4.13.2/src/main/java:org/junit/internal/builders/IgnoredBuilder.java]]
-[WARNING] [parsing completed 4ms]
+[WARNING] [parsing completed 0ms]
 [WARNING] [loading /build/junit4-4.13.2/src/main/java/org/junit/internal/builders/SuiteMethodBuilder.java]
 [WARNING] [parsing started DirectoryFileObject[/build/junit4-4.13.2/src/main/java:org/junit/internal/builders/SuiteMethodBuilder.java]]
-[WARNING] [parsing completed 11ms]
+[WARNING] [parsing completed 1ms]
 [WARNING] [loading /build/junit4-4.13.2/src/main/java/org/junit/internal/requests/MemoizingRequest.java]
 [WARNING] [parsing started DirectoryFileObject[/build/junit4-4.13.2/src/main/java:org/junit/internal/requests/MemoizingRequest.java]]
 [WARNING] [parsing completed 1ms]
@@ -3411,7 +3448,7 @@
 [WARNING] Generating /build/junit4-4.13.2/target/apidocs/index-all.html...
 [WARNING] Generating /build/junit4-4.13.2/target/apidocs/overview-summary.html...
 [WARNING] Generating /build/junit4-4.13.2/target/apidocs/help-doc.html...
-[WARNING] [done in 28597 ms]
+[WARNING] [done in 13751 ms]
 [INFO] Building jar: /build/junit4-4.13.2/target/junit-4.13.2-javadoc.jar
 [INFO] 
 [INFO] ----------------------------< junit:junit >-----------------------------
@@ -3469,229 +3506,229 @@
 [WARNING] Loading source files for package junit.framework...
 [WARNING] Loading source files for package junit.extensions...
 [WARNING] [parsing started DirectoryFileObject[/build/junit4-4.13.2/src/main/java:org/junit/validator/ValidateWith.java]]
-[WARNING] [parsing completed 61ms]
+[WARNING] [parsing completed 42ms]
 [WARNING] [parsing started DirectoryFileObject[/build/junit4-4.13.2/src/main/java:org/junit/validator/TestClassValidator.java]]
-[WARNING] [parsing completed 10ms]
+[WARNING] [parsing completed 5ms]
 [WARNING] [parsing started DirectoryFileObject[/build/junit4-4.13.2/src/main/java:org/junit/validator/PublicClassValidator.java]]
-[WARNING] [parsing completed 24ms]
+[WARNING] [parsing completed 13ms]
 [WARNING] [parsing started DirectoryFileObject[/build/junit4-4.13.2/src/main/java:org/junit/validator/AnnotationsValidator.java]]
-[WARNING] [parsing completed 38ms]
+[WARNING] [parsing completed 21ms]
 [WARNING] [parsing started DirectoryFileObject[/build/junit4-4.13.2/src/main/java:org/junit/validator/AnnotationValidatorFactory.java]]
-[WARNING] [parsing completed 109ms]
+[WARNING] [parsing completed 32ms]
 [WARNING] [parsing started DirectoryFileObject[/build/junit4-4.13.2/src/main/java:org/junit/validator/AnnotationValidator.java]]
-[WARNING] [parsing completed 9ms]
+[WARNING] [parsing completed 13ms]
 [WARNING] [parsing started DirectoryFileObject[/build/junit4-4.13.2/src/main/java:org/junit/runners/parameterized/TestWithParameters.java]]
-[WARNING] [parsing completed 38ms]
+[WARNING] [parsing completed 12ms]
 [WARNING] [parsing started DirectoryFileObject[/build/junit4-4.13.2/src/main/java:org/junit/runners/parameterized/ParametersRunnerFactory.java]]
-[WARNING] [parsing completed 11ms]
+[WARNING] [parsing completed 2ms]
 [WARNING] [parsing started DirectoryFileObject[/build/junit4-4.13.2/src/main/java:org/junit/runners/parameterized/BlockJUnit4ClassRunnerWithParametersFactory.java]]
-[WARNING] [parsing completed 8ms]
+[WARNING] [parsing completed 2ms]
 [WARNING] [parsing started DirectoryFileObject[/build/junit4-4.13.2/src/main/java:org/junit/runners/parameterized/BlockJUnit4ClassRunnerWithParameters.java]]
-[WARNING] [parsing completed 127ms]
+[WARNING] [parsing completed 49ms]
 [WARNING] [parsing started DirectoryFileObject[/build/junit4-4.13.2/src/main/java:org/junit/runners/package-info.java]]
 [WARNING] [parsing completed 1ms]
 [WARNING] [parsing started DirectoryFileObject[/build/junit4-4.13.2/src/main/java:org/junit/runners/Suite.java]]
-[WARNING] [parsing completed 22ms]
+[WARNING] [parsing completed 11ms]
 [WARNING] [parsing started DirectoryFileObject[/build/junit4-4.13.2/src/main/java:org/junit/runners/RuleContainer.java]]
-[WARNING] [parsing completed 21ms]
+[WARNING] [parsing completed 12ms]
 [WARNING] [parsing started DirectoryFileObject[/build/junit4-4.13.2/src/main/java:org/junit/runners/ParentRunner.java]]
-[WARNING] [parsing completed 53ms]
+[WARNING] [parsing completed 79ms]
 [WARNING] [parsing started DirectoryFileObject[/build/junit4-4.13.2/src/main/java:org/junit/runners/Parameterized.java]]
-[WARNING] [parsing completed 105ms]
+[WARNING] [parsing completed 40ms]
 [WARNING] [parsing started DirectoryFileObject[/build/junit4-4.13.2/src/main/java:org/junit/runners/MethodSorters.java]]
-[WARNING] [parsing completed 5ms]
+[WARNING] [parsing completed 6ms]
 [WARNING] [parsing started DirectoryFileObject[/build/junit4-4.13.2/src/main/java:org/junit/runners/JUnit4.java]]
-[WARNING] [parsing completed 3ms]
+[WARNING] [parsing completed 4ms]
 [WARNING] [parsing started DirectoryFileObject[/build/junit4-4.13.2/src/main/java:org/junit/runners/BlockJUnit4ClassRunner.java]]
-[WARNING] [parsing completed 73ms]
+[WARNING] [parsing completed 50ms]
 [WARNING] [parsing started DirectoryFileObject[/build/junit4-4.13.2/src/main/java:org/junit/runners/AllTests.java]]
-[WARNING] [parsing completed 3ms]
+[WARNING] [parsing completed 2ms]
 [WARNING] [parsing started DirectoryFileObject[/build/junit4-4.13.2/src/main/java:org/junit/runners/model/TestTimedOutException.java]]
-[WARNING] [parsing completed 15ms]
+[WARNING] [parsing completed 3ms]
 [WARNING] [parsing started DirectoryFileObject[/build/junit4-4.13.2/src/main/java:org/junit/runners/model/TestClass.java]]
-[WARNING] [parsing completed 36ms]
+[WARNING] [parsing completed 24ms]
 [WARNING] [parsing started DirectoryFileObject[/build/junit4-4.13.2/src/main/java:org/junit/runners/model/Statement.java]]
-[WARNING] [parsing completed 6ms]
+[WARNING] [parsing completed 1ms]
 [WARNING] [parsing started DirectoryFileObject[/build/junit4-4.13.2/src/main/java:org/junit/runners/model/RunnerScheduler.java]]
 [WARNING] [parsing completed 2ms]
 [WARNING] [parsing started DirectoryFileObject[/build/junit4-4.13.2/src/main/java:org/junit/runners/model/RunnerBuilder.java]]
-[WARNING] [parsing completed 8ms]
+[WARNING] [parsing completed 9ms]
 [WARNING] [parsing started DirectoryFileObject[/build/junit4-4.13.2/src/main/java:org/junit/runners/model/NoGenericTypeParametersValidator.java]]
 [WARNING] [parsing completed 12ms]
 [WARNING] [parsing started DirectoryFileObject[/build/junit4-4.13.2/src/main/java:org/junit/runners/model/MultipleFailureException.java]]
-[WARNING] [parsing completed 5ms]
+[WARNING] [parsing completed 9ms]
 [WARNING] [parsing started DirectoryFileObject[/build/junit4-4.13.2/src/main/java:org/junit/runners/model/MemberValueConsumer.java]]
-[WARNING] [parsing completed 1ms]
+[WARNING] [parsing completed 2ms]
 [WARNING] [parsing started DirectoryFileObject[/build/junit4-4.13.2/src/main/java:org/junit/runners/model/InvalidTestClassError.java]]
 [WARNING] [parsing completed 3ms]
 [WARNING] [parsing started DirectoryFileObject[/build/junit4-4.13.2/src/main/java:org/junit/runners/model/InitializationError.java]]
-[WARNING] [parsing completed 3ms]
+[WARNING] [parsing completed 2ms]
 [WARNING] [parsing started DirectoryFileObject[/build/junit4-4.13.2/src/main/java:org/junit/runners/model/FrameworkMethod.java]]
-[WARNING] [parsing completed 51ms]
-[WARNING] [parsing started DirectoryFileObject[/build/junit4-4.13.2/src/main/java:org/junit/runners/model/FrameworkMember.java]]
 [WARNING] [parsing completed 15ms]
+[WARNING] [parsing started DirectoryFileObject[/build/junit4-4.13.2/src/main/java:org/junit/runners/model/FrameworkMember.java]]
+[WARNING] [parsing completed 3ms]
 [WARNING] [parsing started DirectoryFileObject[/build/junit4-4.13.2/src/main/java:org/junit/runners/model/FrameworkField.java]]
-[WARNING] [parsing completed 16ms]
+[WARNING] [parsing completed 4ms]
 [WARNING] [parsing started DirectoryFileObject[/build/junit4-4.13.2/src/main/java:org/junit/runners/model/Annotatable.java]]
-[WARNING] [parsing completed 5ms]
-[WARNING] [parsing started DirectoryFileObject[/build/junit4-4.13.2/src/main/java:org/junit/runner/package-info.java]]
 [WARNING] [parsing completed 1ms]
+[WARNING] [parsing started DirectoryFileObject[/build/junit4-4.13.2/src/main/java:org/junit/runner/package-info.java]]
+[WARNING] [parsing completed 0ms]
 [WARNING] [parsing started DirectoryFileObject[/build/junit4-4.13.2/src/main/java:org/junit/runner/Runner.java]]
 [WARNING] [parsing completed 3ms]
 [WARNING] [parsing started DirectoryFileObject[/build/junit4-4.13.2/src/main/java:org/junit/runner/RunWith.java]]
-[WARNING] [parsing completed 11ms]
+[WARNING] [parsing completed 35ms]
 [WARNING] [parsing started DirectoryFileObject[/build/junit4-4.13.2/src/main/java:org/junit/runner/Result.java]]
-[WARNING] [parsing completed 13ms]
+[WARNING] [parsing completed 19ms]
 [WARNING] [parsing started DirectoryFileObject[/build/junit4-4.13.2/src/main/java:org/junit/runner/Request.java]]
-[WARNING] [parsing completed 13ms]
+[WARNING] [parsing completed 21ms]
 [WARNING] [parsing started DirectoryFileObject[/build/junit4-4.13.2/src/main/java:org/junit/runner/OrderWithValidator.java]]
-[WARNING] [parsing completed 7ms]
+[WARNING] [parsing completed 2ms]
 [WARNING] [parsing started DirectoryFileObject[/build/junit4-4.13.2/src/main/java:org/junit/runner/OrderWith.java]]
-[WARNING] [parsing completed 6ms]
+[WARNING] [parsing completed 1ms]
 [WARNING] [parsing started DirectoryFileObject[/build/junit4-4.13.2/src/main/java:org/junit/runner/JUnitCore.java]]
-[WARNING] [parsing completed 11ms]
+[WARNING] [parsing completed 24ms]
 [WARNING] [parsing started DirectoryFileObject[/build/junit4-4.13.2/src/main/java:org/junit/runner/JUnitCommandLineParseResult.java]]
-[WARNING] [parsing completed 22ms]
+[WARNING] [parsing completed 25ms]
 [WARNING] [parsing started DirectoryFileObject[/build/junit4-4.13.2/src/main/java:org/junit/runner/FilterFactoryParams.java]]
-[WARNING] [parsing completed 6ms]
+[WARNING] [parsing completed 1ms]
 [WARNING] [parsing started DirectoryFileObject[/build/junit4-4.13.2/src/main/java:org/junit/runner/FilterFactory.java]]
 [WARNING] [parsing completed 2ms]
 [WARNING] [parsing started DirectoryFileObject[/build/junit4-4.13.2/src/main/java:org/junit/runner/FilterFactories.java]]
-[WARNING] [parsing completed 7ms]
+[WARNING] [parsing completed 4ms]
 [WARNING] [parsing started DirectoryFileObject[/build/junit4-4.13.2/src/main/java:org/junit/runner/Description.java]]
-[WARNING] [parsing completed 126ms]
+[WARNING] [parsing completed 42ms]
 [WARNING] [parsing started DirectoryFileObject[/build/junit4-4.13.2/src/main/java:org/junit/runner/Describable.java]]
-[WARNING] [parsing completed 1ms]
+[WARNING] [parsing completed 0ms]
 [WARNING] [parsing started DirectoryFileObject[/build/junit4-4.13.2/src/main/java:org/junit/runner/Computer.java]]
-[WARNING] [parsing completed 8ms]
+[WARNING] [parsing completed 2ms]
 [WARNING] [parsing started DirectoryFileObject[/build/junit4-4.13.2/src/main/java:org/junit/runner/notification/package-info.java]]
-[WARNING] [parsing completed 0ms]
+[WARNING] [parsing completed 1ms]
 [WARNING] [parsing started DirectoryFileObject[/build/junit4-4.13.2/src/main/java:org/junit/runner/notification/SynchronizedRunListener.java]]
-[WARNING] [parsing completed 15ms]
+[WARNING] [parsing completed 5ms]
 [WARNING] [parsing started DirectoryFileObject[/build/junit4-4.13.2/src/main/java:org/junit/runner/notification/StoppedByUserException.java]]
-[WARNING] [parsing completed 1ms]
+[WARNING] [parsing completed 0ms]
 [WARNING] [parsing started DirectoryFileObject[/build/junit4-4.13.2/src/main/java:org/junit/runner/notification/RunNotifier.java]]
-[WARNING] [parsing completed 16ms]
+[WARNING] [parsing completed 8ms]
 [WARNING] [parsing started DirectoryFileObject[/build/junit4-4.13.2/src/main/java:org/junit/runner/notification/RunListener.java]]
-[WARNING] [parsing completed 22ms]
+[WARNING] [parsing completed 7ms]
 [WARNING] [parsing started DirectoryFileObject[/build/junit4-4.13.2/src/main/java:org/junit/runner/notification/Failure.java]]
-[WARNING] [parsing completed 4ms]
+[WARNING] [parsing completed 16ms]
 [WARNING] [parsing started DirectoryFileObject[/build/junit4-4.13.2/src/main/java:org/junit/runner/manipulation/package-info.java]]
 [WARNING] [parsing completed 1ms]
 [WARNING] [parsing started DirectoryFileObject[/build/junit4-4.13.2/src/main/java:org/junit/runner/manipulation/Sorter.java]]
-[WARNING] [parsing completed 3ms]
+[WARNING] [parsing completed 11ms]
 [WARNING] [parsing started DirectoryFileObject[/build/junit4-4.13.2/src/main/java:org/junit/runner/manipulation/Sortable.java]]
 [WARNING] [parsing completed 1ms]
 [WARNING] [parsing started DirectoryFileObject[/build/junit4-4.13.2/src/main/java:org/junit/runner/manipulation/Ordering.java]]
-[WARNING] [parsing completed 16ms]
+[WARNING] [parsing completed 13ms]
 [WARNING] [parsing started DirectoryFileObject[/build/junit4-4.13.2/src/main/java:org/junit/runner/manipulation/Orderer.java]]
-[WARNING] [parsing completed 4ms]
+[WARNING] [parsing completed 12ms]
 [WARNING] [parsing started DirectoryFileObject[/build/junit4-4.13.2/src/main/java:org/junit/runner/manipulation/Orderable.java]]
-[WARNING] [parsing completed 0ms]
+[WARNING] [parsing completed 2ms]
 [WARNING] [parsing started DirectoryFileObject[/build/junit4-4.13.2/src/main/java:org/junit/runner/manipulation/NoTestsRemainException.java]]
 [WARNING] [parsing completed 1ms]
 [WARNING] [parsing started DirectoryFileObject[/build/junit4-4.13.2/src/main/java:org/junit/runner/manipulation/InvalidOrderingException.java]]
-[WARNING] [parsing completed 6ms]
+[WARNING] [parsing completed 1ms]
 [WARNING] [parsing started DirectoryFileObject[/build/junit4-4.13.2/src/main/java:org/junit/runner/manipulation/Filterable.java]]
-[WARNING] [parsing completed 7ms]
+[WARNING] [parsing completed 2ms]
 [WARNING] [parsing started DirectoryFileObject[/build/junit4-4.13.2/src/main/java:org/junit/runner/manipulation/Filter.java]]
-[WARNING] [parsing completed 5ms]
+[WARNING] [parsing completed 4ms]
 [WARNING] [parsing started DirectoryFileObject[/build/junit4-4.13.2/src/main/java:org/junit/runner/manipulation/Alphanumeric.java]]
-[WARNING] [parsing completed 2ms]
-[WARNING] [parsing started DirectoryFileObject[/build/junit4-4.13.2/src/main/java:org/junit/rules/Verifier.java]]
 [WARNING] [parsing completed 1ms]
+[WARNING] [parsing started DirectoryFileObject[/build/junit4-4.13.2/src/main/java:org/junit/rules/Verifier.java]]
+[WARNING] [parsing completed 6ms]
 [WARNING] [parsing started DirectoryFileObject[/build/junit4-4.13.2/src/main/java:org/junit/rules/Timeout.java]]
-[WARNING] [parsing completed 7ms]
+[WARNING] [parsing completed 5ms]
 [WARNING] [parsing started DirectoryFileObject[/build/junit4-4.13.2/src/main/java:org/junit/rules/TestWatchman.java]]
-[WARNING] [parsing completed 8ms]
+[WARNING] [parsing completed 3ms]
 [WARNING] [parsing started DirectoryFileObject[/build/junit4-4.13.2/src/main/java:org/junit/rules/TestWatcher.java]]
-[WARNING] [parsing completed 6ms]
+[WARNING] [parsing completed 7ms]
 [WARNING] [parsing started DirectoryFileObject[/build/junit4-4.13.2/src/main/java:org/junit/rules/TestRule.java]]
-[WARNING] [parsing completed 1ms]
+[WARNING] [parsing completed 3ms]
 [WARNING] [parsing started DirectoryFileObject[/build/junit4-4.13.2/src/main/java:org/junit/rules/TestName.java]]
-[WARNING] [parsing completed 6ms]
+[WARNING] [parsing completed 1ms]
 [WARNING] [parsing started DirectoryFileObject[/build/junit4-4.13.2/src/main/java:org/junit/rules/TemporaryFolder.java]]
-[WARNING] [parsing completed 23ms]
+[WARNING] [parsing completed 16ms]
 [WARNING] [parsing started DirectoryFileObject[/build/junit4-4.13.2/src/main/java:org/junit/rules/Stopwatch.java]]
-[WARNING] [parsing completed 10ms]
+[WARNING] [parsing completed 7ms]
 [WARNING] [parsing started DirectoryFileObject[/build/junit4-4.13.2/src/main/java:org/junit/rules/RunRules.java]]
 [WARNING] [parsing completed 2ms]
 [WARNING] [parsing started DirectoryFileObject[/build/junit4-4.13.2/src/main/java:org/junit/rules/RuleChain.java]]
 [WARNING] [parsing completed 4ms]
 [WARNING] [parsing started DirectoryFileObject[/build/junit4-4.13.2/src/main/java:org/junit/rules/MethodRule.java]]
-[WARNING] [parsing completed 1ms]
+[WARNING] [parsing completed 2ms]
 [WARNING] [parsing started DirectoryFileObject[/build/junit4-4.13.2/src/main/java:org/junit/rules/ExternalResource.java]]
-[WARNING] [parsing completed 7ms]
+[WARNING] [parsing completed 2ms]
 [WARNING] [parsing started DirectoryFileObject[/build/junit4-4.13.2/src/main/java:org/junit/rules/ExpectedExceptionMatcherBuilder.java]]
 [WARNING] [parsing completed 3ms]
 [WARNING] [parsing started DirectoryFileObject[/build/junit4-4.13.2/src/main/java:org/junit/rules/ExpectedException.java]]
-[WARNING] [parsing completed 7ms]
+[WARNING] [parsing completed 9ms]
 [WARNING] [parsing started DirectoryFileObject[/build/junit4-4.13.2/src/main/java:org/junit/rules/ErrorCollector.java]]
-[WARNING] [parsing completed 13ms]
+[WARNING] [parsing completed 18ms]
 [WARNING] [parsing started DirectoryFileObject[/build/junit4-4.13.2/src/main/java:org/junit/rules/DisableOnDebug.java]]
-[WARNING] [parsing completed 4ms]
+[WARNING] [parsing completed 5ms]
 [WARNING] [parsing started DirectoryFileObject[/build/junit4-4.13.2/src/main/java:org/junit/package-info.java]]
-[WARNING] [parsing completed 0ms]
-[WARNING] [parsing started DirectoryFileObject[/build/junit4-4.13.2/src/main/java:org/junit/TestCouldNotBeSkippedException.java]]
 [WARNING] [parsing completed 1ms]
+[WARNING] [parsing started DirectoryFileObject[/build/junit4-4.13.2/src/main/java:org/junit/TestCouldNotBeSkippedException.java]]
+[WARNING] [parsing completed 3ms]
 [WARNING] [parsing started DirectoryFileObject[/build/junit4-4.13.2/src/main/java:org/junit/Test.java]]
 [WARNING] [parsing completed 4ms]
 [WARNING] [parsing started DirectoryFileObject[/build/junit4-4.13.2/src/main/java:org/junit/Rule.java]]
 [WARNING] [parsing completed 2ms]
 [WARNING] [parsing started DirectoryFileObject[/build/junit4-4.13.2/src/main/java:org/junit/Ignore.java]]
-[WARNING] [parsing completed 2ms]
+[WARNING] [parsing completed 1ms]
 [WARNING] [parsing started DirectoryFileObject[/build/junit4-4.13.2/src/main/java:org/junit/FixMethodOrder.java]]
-[WARNING] [parsing completed 2ms]
+[WARNING] [parsing completed 1ms]
 [WARNING] [parsing started DirectoryFileObject[/build/junit4-4.13.2/src/main/java:org/junit/ComparisonFailure.java]]
-[WARNING] [parsing completed 13ms]
+[WARNING] [parsing completed 6ms]
 [WARNING] [parsing started DirectoryFileObject[/build/junit4-4.13.2/src/main/java:org/junit/ClassRule.java]]
-[WARNING] [parsing completed 7ms]
+[WARNING] [parsing completed 3ms]
 [WARNING] [parsing started DirectoryFileObject[/build/junit4-4.13.2/src/main/java:org/junit/BeforeClass.java]]
-[WARNING] [parsing completed 1ms]
+[WARNING] [parsing completed 0ms]
 [WARNING] [parsing started DirectoryFileObject[/build/junit4-4.13.2/src/main/java:org/junit/Before.java]]
 [WARNING] [parsing completed 1ms]
 [WARNING] [parsing started DirectoryFileObject[/build/junit4-4.13.2/src/main/java:org/junit/AssumptionViolatedException.java]]
 [WARNING] [parsing completed 2ms]
 [WARNING] [parsing started DirectoryFileObject[/build/junit4-4.13.2/src/main/java:org/junit/Assume.java]]
-[WARNING] [parsing completed 9ms]
+[WARNING] [parsing completed 5ms]
 [WARNING] [parsing started DirectoryFileObject[/build/junit4-4.13.2/src/main/java:org/junit/Assert.java]]
-[WARNING] [parsing completed 45ms]
+[WARNING] [parsing completed 38ms]
 [WARNING] [parsing started DirectoryFileObject[/build/junit4-4.13.2/src/main/java:org/junit/AfterClass.java]]
-[WARNING] [parsing completed 2ms]
+[WARNING] [parsing completed 10ms]
 [WARNING] [parsing started DirectoryFileObject[/build/junit4-4.13.2/src/main/java:org/junit/After.java]]
-[WARNING] [parsing completed 26ms]
+[WARNING] [parsing completed 7ms]
 [WARNING] [parsing started DirectoryFileObject[/build/junit4-4.13.2/src/main/java:org/junit/matchers/JUnitMatchers.java]]
-[WARNING] [parsing completed 5ms]
+[WARNING] [parsing completed 4ms]
 [WARNING] [parsing started DirectoryFileObject[/build/junit4-4.13.2/src/main/java:org/junit/matchers/package-info.java]]
 [WARNING] [parsing completed 1ms]
 [WARNING] [parsing started DirectoryFileObject[/build/junit4-4.13.2/src/main/java:org/junit/internal/Throwables.java]]
-[WARNING] [parsing completed 17ms]
+[WARNING] [parsing completed 11ms]
 [WARNING] [parsing started DirectoryFileObject[/build/junit4-4.13.2/src/main/java:org/junit/internal/TextListener.java]]
-[WARNING] [parsing completed 14ms]
+[WARNING] [parsing completed 9ms]
 [WARNING] [parsing started DirectoryFileObject[/build/junit4-4.13.2/src/main/java:org/junit/internal/SerializableValueDescription.java]]
-[WARNING] [parsing completed 1ms]
+[WARNING] [parsing completed 2ms]
 [WARNING] [parsing started DirectoryFileObject[/build/junit4-4.13.2/src/main/java:org/junit/internal/SerializableMatcherDescription.java]]
-[WARNING] [parsing completed 3ms]
+[WARNING] [parsing completed 2ms]
 [WARNING] [parsing started DirectoryFileObject[/build/junit4-4.13.2/src/main/java:org/junit/internal/RealSystem.java]]
 [WARNING] [parsing completed 1ms]
 [WARNING] [parsing started DirectoryFileObject[/build/junit4-4.13.2/src/main/java:org/junit/internal/MethodSorter.java]]
-[WARNING] [parsing completed 4ms]
+[WARNING] [parsing completed 8ms]
 [WARNING] [parsing started DirectoryFileObject[/build/junit4-4.13.2/src/main/java:org/junit/internal/JUnitSystem.java]]
-[WARNING] [parsing completed 0ms]
+[WARNING] [parsing completed 1ms]
 [WARNING] [parsing started DirectoryFileObject[/build/junit4-4.13.2/src/main/java:org/junit/internal/InexactComparisonCriteria.java]]
-[WARNING] [parsing completed 5ms]
+[WARNING] [parsing completed 2ms]
 [WARNING] [parsing started DirectoryFileObject[/build/junit4-4.13.2/src/main/java:org/junit/internal/ExactComparisonCriteria.java]]
 [WARNING] [parsing completed 1ms]
 [WARNING] [parsing started DirectoryFileObject[/build/junit4-4.13.2/src/main/java:org/junit/internal/ComparisonCriteria.java]]
-[WARNING] [parsing completed 7ms]
-[WARNING] [parsing started DirectoryFileObject[/build/junit4-4.13.2/src/main/java:org/junit/internal/Classes.java]]
 [WARNING] [parsing completed 10ms]
+[WARNING] [parsing started DirectoryFileObject[/build/junit4-4.13.2/src/main/java:org/junit/internal/Classes.java]]
+[WARNING] [parsing completed 2ms]
 [WARNING] [parsing started DirectoryFileObject[/build/junit4-4.13.2/src/main/java:org/junit/internal/Checks.java]]
 [WARNING] [parsing completed 2ms]
 [WARNING] [parsing started DirectoryFileObject[/build/junit4-4.13.2/src/main/java:org/junit/internal/AssumptionViolatedException.java]]
-[WARNING] [parsing completed 5ms]
+[WARNING] [parsing completed 9ms]
 [WARNING] [parsing started DirectoryFileObject[/build/junit4-4.13.2/src/main/java:org/junit/internal/ArrayComparisonFailure.java]]
-[WARNING] [parsing completed 28ms]
+[WARNING] [parsing completed 3ms]
 [WARNING] [parsing started DirectoryFileObject[/build/junit4-4.13.2/src/main/java:org/junit/function/ThrowingRunnable.java]]
 [WARNING] [parsing completed 0ms]
 [WARNING] [parsing started DirectoryFileObject[/build/junit4-4.13.2/src/main/java:org/junit/experimental/theories/suppliers/TestedOnSupplier.java]]
@@ -3699,83 +3736,83 @@
 [WARNING] [parsing started DirectoryFileObject[/build/junit4-4.13.2/src/main/java:org/junit/experimental/theories/suppliers/TestedOn.java]]
 [WARNING] [parsing completed 1ms]
 [WARNING] [parsing started DirectoryFileObject[/build/junit4-4.13.2/src/main/java:org/junit/experimental/theories/internal/SpecificDataPointsSupplier.java]]
-[WARNING] [parsing completed 7ms]
+[WARNING] [parsing completed 4ms]
 [WARNING] [parsing started DirectoryFileObject[/build/junit4-4.13.2/src/main/java:org/junit/experimental/theories/internal/ParameterizedAssertionError.java]]
-[WARNING] [parsing completed 2ms]
+[WARNING] [parsing completed 3ms]
 [WARNING] [parsing started DirectoryFileObject[/build/junit4-4.13.2/src/main/java:org/junit/experimental/theories/internal/EnumSupplier.java]]
-[WARNING] [parsing completed 2ms]
+[WARNING] [parsing completed 1ms]
 [WARNING] [parsing started DirectoryFileObject[/build/junit4-4.13.2/src/main/java:org/junit/experimental/theories/internal/BooleanSupplier.java]]
 [WARNING] [parsing completed 1ms]
 [WARNING] [parsing started DirectoryFileObject[/build/junit4-4.13.2/src/main/java:org/junit/experimental/theories/internal/Assignments.java]]
 [WARNING] [parsing completed 6ms]
 [WARNING] [parsing started DirectoryFileObject[/build/junit4-4.13.2/src/main/java:org/junit/experimental/theories/internal/AllMembersSupplier.java]]
-[WARNING] [parsing completed 15ms]
+[WARNING] [parsing completed 13ms]
 [WARNING] [parsing started DirectoryFileObject[/build/junit4-4.13.2/src/main/java:org/junit/experimental/theories/Theory.java]]
 [WARNING] [parsing completed 1ms]
 [WARNING] [parsing started DirectoryFileObject[/build/junit4-4.13.2/src/main/java:org/junit/experimental/theories/Theories.java]]
-[WARNING] [parsing completed 31ms]
+[WARNING] [parsing completed 14ms]
 [WARNING] [parsing started DirectoryFileObject[/build/junit4-4.13.2/src/main/java:org/junit/experimental/theories/PotentialAssignment.java]]
 [WARNING] [parsing completed 2ms]
 [WARNING] [parsing started DirectoryFileObject[/build/junit4-4.13.2/src/main/java:org/junit/experimental/theories/ParametersSuppliedBy.java]]
-[WARNING] [parsing completed 22ms]
-[WARNING] [parsing started DirectoryFileObject[/build/junit4-4.13.2/src/main/java:org/junit/experimental/theories/ParameterSupplier.java]]
 [WARNING] [parsing completed 2ms]
+[WARNING] [parsing started DirectoryFileObject[/build/junit4-4.13.2/src/main/java:org/junit/experimental/theories/ParameterSupplier.java]]
+[WARNING] [parsing completed 1ms]
 [WARNING] [parsing started DirectoryFileObject[/build/junit4-4.13.2/src/main/java:org/junit/experimental/theories/ParameterSignature.java]]
-[WARNING] [parsing completed 16ms]
+[WARNING] [parsing completed 5ms]
 [WARNING] [parsing started DirectoryFileObject[/build/junit4-4.13.2/src/main/java:org/junit/experimental/theories/FromDataPoints.java]]
-[WARNING] [parsing completed 11ms]
+[WARNING] [parsing completed 2ms]
 [WARNING] [parsing started DirectoryFileObject[/build/junit4-4.13.2/src/main/java:org/junit/experimental/theories/DataPoints.java]]
-[WARNING] [parsing completed 3ms]
+[WARNING] [parsing completed 6ms]
 [WARNING] [parsing started DirectoryFileObject[/build/junit4-4.13.2/src/main/java:org/junit/experimental/theories/DataPoint.java]]
-[WARNING] [parsing completed 2ms]
+[WARNING] [parsing completed 1ms]
 [WARNING] [parsing started DirectoryFileObject[/build/junit4-4.13.2/src/main/java:org/junit/experimental/runners/Enclosed.java]]
-[WARNING] [parsing completed 3ms]
+[WARNING] [parsing completed 2ms]
 [WARNING] [parsing started DirectoryFileObject[/build/junit4-4.13.2/src/main/java:org/junit/experimental/results/ResultMatchers.java]]
-[WARNING] [parsing completed 13ms]
+[WARNING] [parsing completed 3ms]
 [WARNING] [parsing started DirectoryFileObject[/build/junit4-4.13.2/src/main/java:org/junit/experimental/results/PrintableResult.java]]
-[WARNING] [parsing completed 9ms]
-[WARNING] [parsing started DirectoryFileObject[/build/junit4-4.13.2/src/main/java:org/junit/experimental/results/FailureList.java]]
 [WARNING] [parsing completed 2ms]
+[WARNING] [parsing started DirectoryFileObject[/build/junit4-4.13.2/src/main/java:org/junit/experimental/results/FailureList.java]]
+[WARNING] [parsing completed 1ms]
 [WARNING] [parsing started DirectoryFileObject[/build/junit4-4.13.2/src/main/java:org/junit/experimental/max/MaxHistory.java]]
-[WARNING] [parsing completed 17ms]
-[WARNING] [parsing started DirectoryFileObject[/build/junit4-4.13.2/src/main/java:org/junit/experimental/max/MaxCore.java]]
 [WARNING] [parsing completed 9ms]
+[WARNING] [parsing started DirectoryFileObject[/build/junit4-4.13.2/src/main/java:org/junit/experimental/max/MaxCore.java]]
+[WARNING] [parsing completed 5ms]
 [WARNING] [parsing started DirectoryFileObject[/build/junit4-4.13.2/src/main/java:org/junit/experimental/max/CouldNotReadCoreException.java]]
-[WARNING] [parsing completed 0ms]
+[WARNING] [parsing completed 1ms]
 [WARNING] [parsing started DirectoryFileObject[/build/junit4-4.13.2/src/main/java:org/junit/experimental/categories/IncludeCategories.java]]
-[WARNING] [parsing completed 2ms]
+[WARNING] [parsing completed 6ms]
 [WARNING] [parsing started DirectoryFileObject[/build/junit4-4.13.2/src/main/java:org/junit/experimental/categories/ExcludeCategories.java]]
 [WARNING] [parsing completed 1ms]
 [WARNING] [parsing started DirectoryFileObject[/build/junit4-4.13.2/src/main/java:org/junit/experimental/categories/CategoryValidator.java]]
-[WARNING] [parsing completed 3ms]
+[WARNING] [parsing completed 2ms]
 [WARNING] [parsing started DirectoryFileObject[/build/junit4-4.13.2/src/main/java:org/junit/experimental/categories/CategoryFilterFactory.java]]
-[WARNING] [parsing completed 5ms]
+[WARNING] [parsing completed 1ms]
 [WARNING] [parsing started DirectoryFileObject[/build/junit4-4.13.2/src/main/java:org/junit/experimental/categories/Category.java]]
 [WARNING] [parsing completed 1ms]
 [WARNING] [parsing started DirectoryFileObject[/build/junit4-4.13.2/src/main/java:org/junit/experimental/categories/Categories.java]]
-[WARNING] [parsing completed 38ms]
+[WARNING] [parsing completed 15ms]
 [WARNING] [parsing started DirectoryFileObject[/build/junit4-4.13.2/src/main/java:org/junit/experimental/ParallelComputer.java]]
-[WARNING] [parsing completed 3ms]
+[WARNING] [parsing completed 7ms]
 [WARNING] [parsing started DirectoryFileObject[/build/junit4-4.13.2/src/main/java:junit/textui/package-info.java]]
 [WARNING] [parsing completed 1ms]
 [WARNING] [parsing started DirectoryFileObject[/build/junit4-4.13.2/src/main/java:junit/textui/TestRunner.java]]
-[WARNING] [parsing completed 7ms]
-[WARNING] [parsing started DirectoryFileObject[/build/junit4-4.13.2/src/main/java:junit/textui/ResultPrinter.java]]
 [WARNING] [parsing completed 5ms]
+[WARNING] [parsing started DirectoryFileObject[/build/junit4-4.13.2/src/main/java:junit/textui/ResultPrinter.java]]
+[WARNING] [parsing completed 9ms]
 [WARNING] [parsing started DirectoryFileObject[/build/junit4-4.13.2/src/main/java:junit/runner/Version.java]]
 [WARNING] [parsing completed 1ms]
 [WARNING] [parsing started DirectoryFileObject[/build/junit4-4.13.2/src/main/java:junit/runner/package-info.java]]
 [WARNING] [parsing completed 0ms]
 [WARNING] [parsing started DirectoryFileObject[/build/junit4-4.13.2/src/main/java:junit/runner/TestRunListener.java]]
-[WARNING] [parsing completed 1ms]
+[WARNING] [parsing completed 10ms]
 [WARNING] [parsing started DirectoryFileObject[/build/junit4-4.13.2/src/main/java:junit/runner/BaseTestRunner.java]]
-[WARNING] [parsing completed 15ms]
+[WARNING] [parsing completed 9ms]
 [WARNING] [parsing started DirectoryFileObject[/build/junit4-4.13.2/src/main/java:junit/framework/package-info.java]]
 [WARNING] [parsing completed 1ms]
 [WARNING] [parsing started DirectoryFileObject[/build/junit4-4.13.2/src/main/java:junit/framework/TestSuite.java]]
-[WARNING] [parsing completed 34ms]
+[WARNING] [parsing completed 40ms]
 [WARNING] [parsing started DirectoryFileObject[/build/junit4-4.13.2/src/main/java:junit/framework/TestResult.java]]
-[WARNING] [parsing completed 5ms]
+[WARNING] [parsing completed 4ms]
 [WARNING] [parsing started DirectoryFileObject[/build/junit4-4.13.2/src/main/java:junit/framework/TestListener.java]]
 [WARNING] [parsing completed 1ms]
 [WARNING] [parsing started DirectoryFileObject[/build/junit4-4.13.2/src/main/java:junit/framework/TestFailure.java]]
@@ -3785,9 +3822,9 @@
 [WARNING] [parsing started DirectoryFileObject[/build/junit4-4.13.2/src/main/java:junit/framework/Test.java]]
 [WARNING] [parsing completed 0ms]
 [WARNING] [parsing started DirectoryFileObject[/build/junit4-4.13.2/src/main/java:junit/framework/Protectable.java]]
-[WARNING] [parsing completed 0ms]
+[WARNING] [parsing completed 5ms]
 [WARNING] [parsing started DirectoryFileObject[/build/junit4-4.13.2/src/main/java:junit/framework/JUnit4TestCaseFacade.java]]
-[WARNING] [parsing completed 2ms]
+[WARNING] [parsing completed 1ms]
 [WARNING] [parsing started DirectoryFileObject[/build/junit4-4.13.2/src/main/java:junit/framework/JUnit4TestAdapterCache.java]]
 [WARNING] [parsing completed 2ms]
 [WARNING] [parsing started DirectoryFileObject[/build/junit4-4.13.2/src/main/java:junit/framework/JUnit4TestAdapter.java]]
@@ -3795,21 +3832,21 @@
 [WARNING] [parsing started DirectoryFileObject[/build/junit4-4.13.2/src/main/java:junit/framework/ComparisonFailure.java]]
 [WARNING] [parsing completed 2ms]
 [WARNING] [parsing started DirectoryFileObject[/build/junit4-4.13.2/src/main/java:junit/framework/ComparisonCompactor.java]]
-[WARNING] [parsing completed 4ms]
+[WARNING] [parsing completed 8ms]
 [WARNING] [parsing started DirectoryFileObject[/build/junit4-4.13.2/src/main/java:junit/framework/AssertionFailedError.java]]
 [WARNING] [parsing completed 1ms]
 [WARNING] [parsing started DirectoryFileObject[/build/junit4-4.13.2/src/main/java:junit/framework/Assert.java]]
-[WARNING] [parsing completed 13ms]
+[WARNING] [parsing completed 11ms]
 [WARNING] [parsing started DirectoryFileObject[/build/junit4-4.13.2/src/main/java:junit/extensions/package-info.java]]
-[WARNING] [parsing completed 5ms]
-[WARNING] [parsing started DirectoryFileObject[/build/junit4-4.13.2/src/main/java:junit/extensions/TestSetup.java]]
 [WARNING] [parsing completed 1ms]
+[WARNING] [parsing started DirectoryFileObject[/build/junit4-4.13.2/src/main/java:junit/extensions/TestSetup.java]]
+[WARNING] [parsing completed 6ms]
 [WARNING] [parsing started DirectoryFileObject[/build/junit4-4.13.2/src/main/java:junit/extensions/TestDecorator.java]]
 [WARNING] [parsing completed 1ms]
 [WARNING] [parsing started DirectoryFileObject[/build/junit4-4.13.2/src/main/java:junit/extensions/RepeatedTest.java]]
 [WARNING] [parsing completed 1ms]
 [WARNING] [parsing started DirectoryFileObject[/build/junit4-4.13.2/src/main/java:junit/extensions/ActiveTestSuite.java]]
-[WARNING] [parsing completed 2ms]
+[WARNING] [parsing completed 1ms]
 [WARNING] Constructing Javadoc information...
 [WARNING] [search path for source files: /build/junit4-4.13.2/src/main/java,/build/junit4-4.13.2/target/generated-sources/annotations,/build/junit4-4.13.2/src/main/javadoc]
 [WARNING] [search path for class files: /usr/lib/jvm/java-17-openjdk-arm64/lib/modules,/build/junit4-4.13.2/debian/maven-repo/org/hamcrest/hamcrest/debian/hamcrest-debian.jar]
@@ -3867,34 +3904,34 @@
 [WARNING] [loading /879A/java.base/java/io/ObjectInputStream$GetField.sig]
 [WARNING] [loading /build/junit4-4.13.2/src/main/java/org/junit/internal/runners/statements/RunAfters.java]
 [WARNING] [parsing started DirectoryFileObject[/build/junit4-4.13.2/src/main/java:org/junit/internal/runners/statements/RunAfters.java]]
-[WARNING] [parsing completed 7ms]
+[WARNING] [parsing completed 2ms]
 [WARNING] [loading /build/junit4-4.13.2/src/main/java/org/junit/internal/runners/statements/RunBefores.java]
 [WARNING] [parsing started DirectoryFileObject[/build/junit4-4.13.2/src/main/java:org/junit/internal/runners/statements/RunBefores.java]]
 [WARNING] [parsing completed 1ms]
 [WARNING] [loading /87/java.base/java/text/MessageFormat.sig]
 [WARNING] [loading /build/junit4-4.13.2/src/main/java/org/junit/internal/runners/rules/RuleMemberValidator.java]
 [WARNING] [parsing started DirectoryFileObject[/build/junit4-4.13.2/src/main/java:org/junit/internal/runners/rules/RuleMemberValidator.java]]
-[WARNING] [parsing completed 11ms]
+[WARNING] [parsing completed 5ms]
 [WARNING] [loading /8/java.base/java/util/concurrent/ConcurrentMap.sig]
 [WARNING] [loading /87/java.base/java/util/concurrent/TimeUnit.sig]
 [WARNING] [loading /build/junit4-4.13.2/src/main/java/org/junit/internal/runners/statements/ExpectException.java]
 [WARNING] [parsing started DirectoryFileObject[/build/junit4-4.13.2/src/main/java:org/junit/internal/runners/statements/ExpectException.java]]
-[WARNING] [parsing completed 2ms]
+[WARNING] [parsing completed 1ms]
 [WARNING] [loading /build/junit4-4.13.2/src/main/java/org/junit/internal/runners/statements/Fail.java]
 [WARNING] [parsing started DirectoryFileObject[/build/junit4-4.13.2/src/main/java:org/junit/internal/runners/statements/Fail.java]]
-[WARNING] [parsing completed 1ms]
+[WARNING] [parsing completed 0ms]
 [WARNING] [loading /build/junit4-4.13.2/src/main/java/org/junit/internal/runners/statements/FailOnTimeout.java]
 [WARNING] [parsing started DirectoryFileObject[/build/junit4-4.13.2/src/main/java:org/junit/internal/runners/statements/FailOnTimeout.java]]
-[WARNING] [parsing completed 11ms]
+[WARNING] [parsing completed 7ms]
 [WARNING] [loading /build/junit4-4.13.2/src/main/java/org/junit/internal/runners/statements/InvokeMethod.java]
 [WARNING] [parsing started DirectoryFileObject[/build/junit4-4.13.2/src/main/java:org/junit/internal/runners/statements/InvokeMethod.java]]
-[WARNING] [parsing completed 1ms]
+[WARNING] [parsing completed 0ms]
 [WARNING] [loading /89A/java.base/java/util/Iterator.sig]
 [WARNING] [loading /879A/java.base/java/util/concurrent/locks/Lock.sig]
 [WARNING] [loading /87/java.base/java/util/concurrent/locks/ReentrantLock.sig]
 [WARNING] [loading /build/junit4-4.13.2/src/main/java/org/junit/internal/runners/model/EachTestNotifier.java]
 [WARNING] [parsing started DirectoryFileObject[/build/junit4-4.13.2/src/main/java:org/junit/internal/runners/model/EachTestNotifier.java]]
-[WARNING] [parsing completed 2ms]
+[WARNING] [parsing completed 1ms]
 [WARNING] [loading /build/junit4-4.13.2/src/main/java/org/junit/internal/builders/AllDefaultPossibilitiesBuilder.java]
 [WARNING] [parsing started DirectoryFileObject[/build/junit4-4.13.2/src/main/java:org/junit/internal/builders/AllDefaultPossibilitiesBuilder.java]]
 [WARNING] [parsing completed 2ms]
@@ -3917,7 +3954,7 @@
 [WARNING] [parsing completed 1ms]
 [WARNING] [loading /build/junit4-4.13.2/src/main/java/org/junit/internal/runners/JUnit38ClassRunner.java]
 [WARNING] [parsing started DirectoryFileObject[/build/junit4-4.13.2/src/main/java:org/junit/internal/runners/JUnit38ClassRunner.java]]
-[WARNING] [parsing completed 14ms]
+[WARNING] [parsing completed 13ms]
 [WARNING] [loading /87/java.base/java/util/Enumeration.sig]
 [WARNING] [loading /879A/java.base/java/lang/AssertionError.sig]
 [WARNING] [loading /879A/java.base/java/lang/Error.sig]
@@ -3933,16 +3970,16 @@
 [WARNING] [loading /879/java.base/java/io/PrintWriter.sig]
 [WARNING] [loading /build/junit4-4.13.2/src/main/java/org/junit/internal/requests/ClassRequest.java]
 [WARNING] [parsing started DirectoryFileObject[/build/junit4-4.13.2/src/main/java:org/junit/internal/requests/ClassRequest.java]]
-[WARNING] [parsing completed 6ms]
+[WARNING] [parsing completed 1ms]
 [WARNING] [loading /build/junit4-4.13.2/src/main/java/org/junit/internal/requests/FilterRequest.java]
 [WARNING] [parsing started DirectoryFileObject[/build/junit4-4.13.2/src/main/java:org/junit/internal/requests/FilterRequest.java]]
-[WARNING] [parsing completed 3ms]
+[WARNING] [parsing completed 2ms]
 [WARNING] [loading /build/junit4-4.13.2/src/main/java/org/junit/internal/requests/OrderingRequest.java]
 [WARNING] [parsing started DirectoryFileObject[/build/junit4-4.13.2/src/main/java:org/junit/internal/requests/OrderingRequest.java]]
 [WARNING] [parsing completed 1ms]
 [WARNING] [loading /build/junit4-4.13.2/src/main/java/org/junit/internal/requests/SortingRequest.java]
 [WARNING] [parsing started DirectoryFileObject[/build/junit4-4.13.2/src/main/java:org/junit/internal/requests/SortingRequest.java]]
-[WARNING] [parsing completed 0ms]
+[WARNING] [parsing completed 5ms]
 [WARNING] [loading /build/junit4-4.13.2/debian/maven-repo/org/hamcrest/hamcrest/debian/hamcrest-debian.jar(/org/hamcrest/MatcherAssert.class)]
 [WARNING] [loading /87/java.base/java/io/File.sig]
 [WARNING] [loading /87/java.base/java/lang/reflect/Array.sig]
@@ -3995,7 +4032,7 @@
 [WARNING] [loading /879A/java.base/java/util/concurrent/TimeoutException.sig]
 [WARNING] [loading /build/junit4-4.13.2/src/main/java/org/junit/internal/management/ThreadMXBean.java]
 [WARNING] [parsing started DirectoryFileObject[/build/junit4-4.13.2/src/main/java:org/junit/internal/management/ThreadMXBean.java]]
-[WARNING] [parsing completed 3ms]
+[WARNING] [parsing completed 1ms]
 [WARNING] [loading /87/java.base/java/lang/ThreadGroup.sig]
 [WARNING] [loading /879A/java.base/java/lang/InterruptedException.sig]
 [WARNING] [loading /build/junit4-4.13.2/src/main/java/org/junit/internal/builders/JUnit4Builder.java]
@@ -4003,7 +4040,7 @@
 [WARNING] [parsing completed 1ms]
 [WARNING] [loading /build/junit4-4.13.2/src/main/java/org/junit/internal/builders/JUnit3Builder.java]
 [WARNING] [parsing started DirectoryFileObject[/build/junit4-4.13.2/src/main/java:org/junit/internal/builders/JUnit3Builder.java]]
-[WARNING] [parsing completed 1ms]
+[WARNING] [parsing completed 0ms]
 [WARNING] [loading /build/junit4-4.13.2/src/main/java/org/junit/internal/builders/AnnotatedBuilder.java]
 [WARNING] [parsing started DirectoryFileObject[/build/junit4-4.13.2/src/main/java:org/junit/internal/builders/AnnotatedBuilder.java]]
 [WARNING] [parsing completed 2ms]
@@ -4012,10 +4049,10 @@
 [WARNING] [parsing completed 1ms]
 [WARNING] [loading /build/junit4-4.13.2/src/main/java/org/junit/internal/builders/SuiteMethodBuilder.java]
 [WARNING] [parsing started DirectoryFileObject[/build/junit4-4.13.2/src/main/java:org/junit/internal/builders/SuiteMethodBuilder.java]]
-[WARNING] [parsing completed 1ms]
+[WARNING] [parsing completed 0ms]
 [WARNING] [loading /build/junit4-4.13.2/src/main/java/org/junit/internal/requests/MemoizingRequest.java]
 [WARNING] [parsing started DirectoryFileObject[/build/junit4-4.13.2/src/main/java:org/junit/internal/requests/MemoizingRequest.java]]
-[WARNING] [parsing completed 0ms]
+[WARNING] [parsing completed 1ms]
 [WARNING] [loading /879A/java.base/java/lang/Override.sig]
 [WARNING] Building index for all the packages and classes...
 [WARNING] Standard Doclet version 17.0.6+10-Debian-1
@@ -4481,7 +4518,7 @@
 [WARNING] Generating /build/junit4-4.13.2/target/site/apidocs/org/junit/runner/class-use/Runner.html...
 [WARNING] [loading /build/junit4-4.13.2/src/main/java/org/junit/internal/runners/package-info.java]
 [WARNING] [parsing started DirectoryFileObject[/build/junit4-4.13.2/src/main/java:org/junit/internal/runners/package-info.java]]
-[WARNING] [parsing completed 0ms]
+[WARNING] [parsing completed 1ms]
 [WARNING] Generating /build/junit4-4.13.2/target/site/apidocs/org/junit/runner/class-use/RunWith.html...
 [WARNING] Generating /build/junit4-4.13.2/target/site/apidocs/org/junit/runner/class-use/Result.html...
 [WARNING] Generating /build/junit4-4.13.2/target/site/apidocs/org/junit/runner/class-use/Request.html...
@@ -4647,12 +4684,12 @@
 [WARNING] Generating /build/junit4-4.13.2/target/site/apidocs/index-all.html...
 [WARNING] Generating /build/junit4-4.13.2/target/site/apidocs/overview-summary.html...
 [WARNING] Generating /build/junit4-4.13.2/target/site/apidocs/help-doc.html...
-[WARNING] [done in 27902 ms]
+[WARNING] [done in 17660 ms]
 [INFO] ------------------------------------------------------------------------
 [INFO] BUILD SUCCESS
 [INFO] ------------------------------------------------------------------------
-[INFO] Total time:  02:33 min
-[INFO] Finished at: 2024-06-07T00:19:50-12:00
+[INFO] Total time:  01:12 min
+[INFO] Finished at: 2023-05-06T20:02:10+14:00
 [INFO] ------------------------------------------------------------------------
    dh_auto_test
 	/usr/lib/jvm/default-java/bin/java -noverify -cp /usr/share/maven/boot/plexus-classworlds-2.x.jar -Dmaven.home=/usr/share/maven -Dmaven.multiModuleProjectDirectory=/build/junit4-4.13.2 -Dclassworlds.conf=/etc/maven/m2-debian.conf -Dproperties.file.manual=/build/junit4-4.13.2/debian/maven.properties org.codehaus.plexus.classworlds.launcher.Launcher -s/etc/maven/settings-debian.xml -Ddebian.dir=/build/junit4-4.13.2/debian -Dmaven.repo.local=/build/junit4-4.13.2/debian/maven-repo --batch-mode test
@@ -4683,371 +4720,371 @@
 [INFO]  T E S T S
 [INFO] -------------------------------------------------------
 [INFO] Running org.junit.tests.assertion.AssertionTest
-[INFO] Tests run: 98, Failures: 0, Errors: 0, Skipped: 0, Time elapsed: 0.09 s - in org.junit.tests.assertion.AssertionTest
+[INFO] Tests run: 98, Failures: 0, Errors: 0, Skipped: 0, Time elapsed: 0.073 s - in org.junit.tests.assertion.AssertionTest
 [INFO] Running org.junit.tests.assertion.ComparisonFailureTest
-[INFO] Tests run: 12, Failures: 0, Errors: 0, Skipped: 0, Time elapsed: 0.017 s - in org.junit.tests.assertion.ComparisonFailureTest
+[INFO] Tests run: 12, Failures: 0, Errors: 0, Skipped: 0, Time elapsed: 0.007 s - in org.junit.tests.assertion.ComparisonFailureTest
 [INFO] Running org.junit.tests.assertion.MultipleFailureExceptionTest
-[INFO] Tests run: 6, Failures: 0, Errors: 0, Skipped: 0, Time elapsed: 0.001 s - in org.junit.tests.assertion.MultipleFailureExceptionTest
+[INFO] Tests run: 6, Failures: 0, Errors: 0, Skipped: 0, Time elapsed: 0.006 s - in org.junit.tests.assertion.MultipleFailureExceptionTest
 [INFO] Running org.junit.tests.deprecated.JUnit4ClassRunnerTest
-[INFO] Tests run: 2, Failures: 0, Errors: 0, Skipped: 0, Time elapsed: 0.002 s - in org.junit.tests.deprecated.JUnit4ClassRunnerTest
+[INFO] Tests run: 2, Failures: 0, Errors: 0, Skipped: 0, Time elapsed: 0 s - in org.junit.tests.deprecated.JUnit4ClassRunnerTest
 [INFO] Running org.junit.tests.description.AnnotatedDescriptionTest
-[INFO] Tests run: 6, Failures: 0, Errors: 0, Skipped: 0, Time elapsed: 0.014 s - in org.junit.tests.description.AnnotatedDescriptionTest
+[INFO] Tests run: 6, Failures: 0, Errors: 0, Skipped: 0, Time elapsed: 0.009 s - in org.junit.tests.description.AnnotatedDescriptionTest
 [INFO] Running org.junit.tests.description.SuiteDescriptionTest
-[INFO] Tests run: 2, Failures: 0, Errors: 0, Skipped: 0, Time elapsed: 0 s - in org.junit.tests.description.SuiteDescriptionTest
+[INFO] Tests run: 2, Failures: 0, Errors: 0, Skipped: 0, Time elapsed: 0.001 s - in org.junit.tests.description.SuiteDescriptionTest
 [INFO] Running org.junit.tests.description.TestDescriptionMethodNameTest
 [INFO] Tests run: 11, Failures: 0, Errors: 0, Skipped: 0, Time elapsed: 0.002 s - in org.junit.tests.description.TestDescriptionMethodNameTest
 [INFO] Running org.junit.tests.description.TestDescriptionTest
 [INFO] Tests run: 3, Failures: 0, Errors: 0, Skipped: 0, Time elapsed: 0 s - in org.junit.tests.description.TestDescriptionTest
 [INFO] Running org.junit.experimental.categories.CategoriesAndParameterizedTest
-[INFO] Tests run: 3, Failures: 0, Errors: 0, Skipped: 0, Time elapsed: 0.001 s - in org.junit.experimental.categories.CategoriesAndParameterizedTest
+[INFO] Tests run: 3, Failures: 0, Errors: 0, Skipped: 0, Time elapsed: 0 s - in org.junit.experimental.categories.CategoriesAndParameterizedTest
 [INFO] Running org.junit.experimental.categories.CategoryFilterFactoryTest
 [INFO] Tests run: 2, Failures: 0, Errors: 0, Skipped: 0, Time elapsed: 0 s - in org.junit.experimental.categories.CategoryFilterFactoryTest
 [INFO] Running org.junit.experimental.categories.CategoryTest
-[INFO] Tests run: 26, Failures: 0, Errors: 0, Skipped: 0, Time elapsed: 0.465 s - in org.junit.experimental.categories.CategoryTest
+[INFO] Tests run: 26, Failures: 0, Errors: 0, Skipped: 0, Time elapsed: 0.09 s - in org.junit.experimental.categories.CategoryTest
 [INFO] Running org.junit.experimental.categories.CategoryValidatorTest
-[INFO] Tests run: 5, Failures: 0, Errors: 0, Skipped: 0, Time elapsed: 0.001 s - in org.junit.experimental.categories.CategoryValidatorTest
+[INFO] Tests run: 5, Failures: 0, Errors: 0, Skipped: 0, Time elapsed: 0 s - in org.junit.experimental.categories.CategoryValidatorTest
 [INFO] Running org.junit.experimental.categories.JavadocTest
-[INFO] Tests run: 2, Failures: 0, Errors: 0, Skipped: 0, Time elapsed: 0.058 s - in org.junit.experimental.categories.JavadocTest
+[INFO] Tests run: 2, Failures: 0, Errors: 0, Skipped: 0, Time elapsed: 0.001 s - in org.junit.experimental.categories.JavadocTest
 [INFO] Running org.junit.experimental.categories.MultiCategoryTest
-[INFO] Tests run: 5, Failures: 0, Errors: 0, Skipped: 0, Time elapsed: 0.171 s - in org.junit.experimental.categories.MultiCategoryTest
+[INFO] Tests run: 5, Failures: 0, Errors: 0, Skipped: 0, Time elapsed: 0.021 s - in org.junit.experimental.categories.MultiCategoryTest
 [INFO] Running org.junit.tests.experimental.max.DescriptionTest
-[INFO] Tests run: 9, Failures: 0, Errors: 0, Skipped: 0, Time elapsed: 0.058 s - in org.junit.tests.experimental.max.DescriptionTest
+[INFO] Tests run: 9, Failures: 0, Errors: 0, Skipped: 0, Time elapsed: 0.012 s - in org.junit.tests.experimental.max.DescriptionTest
 [INFO] Running org.junit.tests.experimental.max.JUnit38SortingTest
-[INFO] Tests run: 1, Failures: 0, Errors: 0, Skipped: 0, Time elapsed: 0.266 s - in org.junit.tests.experimental.max.JUnit38SortingTest
+[INFO] Tests run: 1, Failures: 0, Errors: 0, Skipped: 0, Time elapsed: 0.056 s - in org.junit.tests.experimental.max.JUnit38SortingTest
 [INFO] Running org.junit.tests.experimental.max.MaxStarterTest
-[INFO] Tests run: 16, Failures: 0, Errors: 0, Skipped: 0, Time elapsed: 1.404 s - in org.junit.tests.experimental.max.MaxStarterTest
+[INFO] Tests run: 16, Failures: 0, Errors: 0, Skipped: 0, Time elapsed: 0.728 s - in org.junit.tests.experimental.max.MaxStarterTest
 [INFO] Running org.junit.tests.experimental.parallel.ParallelClassTest
-[INFO] Tests run: 1, Failures: 0, Errors: 0, Skipped: 0, Time elapsed: 0.035 s - in org.junit.tests.experimental.parallel.ParallelClassTest
+[INFO] Tests run: 1, Failures: 0, Errors: 0, Skipped: 0, Time elapsed: 0.01 s - in org.junit.tests.experimental.parallel.ParallelClassTest
 [INFO] Running org.junit.tests.experimental.parallel.ParallelMethodTest
-[INFO] Tests run: 1, Failures: 0, Errors: 0, Skipped: 0, Time elapsed: 0.041 s - in org.junit.tests.experimental.parallel.ParallelMethodTest
+[INFO] Tests run: 1, Failures: 0, Errors: 0, Skipped: 0, Time elapsed: 0.004 s - in org.junit.tests.experimental.parallel.ParallelMethodTest
 [INFO] Running org.junit.tests.experimental.results.PrintableResultTest
-[INFO] Tests run: 2, Failures: 0, Errors: 0, Skipped: 0, Time elapsed: 0.051 s - in org.junit.tests.experimental.results.PrintableResultTest
+[INFO] Tests run: 2, Failures: 0, Errors: 0, Skipped: 0, Time elapsed: 0.035 s - in org.junit.tests.experimental.results.PrintableResultTest
 [INFO] Running org.junit.tests.experimental.results.ResultMatchersTest
-[INFO] Tests run: 3, Failures: 0, Errors: 0, Skipped: 0, Time elapsed: 0.001 s - in org.junit.tests.experimental.results.ResultMatchersTest
+[INFO] Tests run: 3, Failures: 0, Errors: 0, Skipped: 0, Time elapsed: 0.006 s - in org.junit.tests.experimental.results.ResultMatchersTest
 [INFO] Running org.junit.tests.experimental.theories.internal.AllMembersSupplierTest
-[INFO] Tests run: 10, Failures: 0, Errors: 0, Skipped: 0, Time elapsed: 0.006 s - in org.junit.tests.experimental.theories.internal.AllMembersSupplierTest
+[INFO] Tests run: 10, Failures: 0, Errors: 0, Skipped: 0, Time elapsed: 0.019 s - in org.junit.tests.experimental.theories.internal.AllMembersSupplierTest
 [INFO] Running org.junit.tests.experimental.theories.internal.ParameterizedAssertionErrorTest
-[INFO] Tests run: 7, Failures: 0, Errors: 0, Skipped: 0, Time elapsed: 0.006 s - in org.junit.tests.experimental.theories.internal.ParameterizedAssertionErrorTest
+[INFO] Tests run: 7, Failures: 0, Errors: 0, Skipped: 0, Time elapsed: 0.017 s - in org.junit.tests.experimental.theories.internal.ParameterizedAssertionErrorTest
 [INFO] Running org.junit.tests.experimental.theories.internal.SpecificDataPointsSupplierTest
-[INFO] Tests run: 6, Failures: 0, Errors: 0, Skipped: 0, Time elapsed: 0.034 s - in org.junit.tests.experimental.theories.internal.SpecificDataPointsSupplierTest
+[INFO] Tests run: 6, Failures: 0, Errors: 0, Skipped: 0, Time elapsed: 0.004 s - in org.junit.tests.experimental.theories.internal.SpecificDataPointsSupplierTest
 [INFO] Running org.junit.tests.experimental.theories.runner.FailingDataPointMethods
-[INFO] Tests run: 6, Failures: 0, Errors: 0, Skipped: 0, Time elapsed: 0.015 s - in org.junit.tests.experimental.theories.runner.FailingDataPointMethods
+[INFO] Tests run: 6, Failures: 0, Errors: 0, Skipped: 0, Time elapsed: 0.02 s - in org.junit.tests.experimental.theories.runner.FailingDataPointMethods
 [INFO] Running org.junit.tests.experimental.theories.runner.SuccessfulWithDataPointFields$StaticPublicNonDataPoints
-[INFO] Tests run: 1, Failures: 0, Errors: 0, Skipped: 0, Time elapsed: 0 s - in org.junit.tests.experimental.theories.runner.SuccessfulWithDataPointFields$StaticPublicNonDataPoints
+[INFO] Tests run: 1, Failures: 0, Errors: 0, Skipped: 0, Time elapsed: 0.001 s - in org.junit.tests.experimental.theories.runner.SuccessfulWithDataPointFields$StaticPublicNonDataPoints
 [INFO] Running org.junit.tests.experimental.theories.runner.SuccessfulWithDataPointFields$OneTestTwoAnnotations
-[INFO] Tests run: 1, Failures: 0, Errors: 0, Skipped: 0, Time elapsed: 0.008 s - in org.junit.tests.experimental.theories.runner.SuccessfulWithDataPointFields$OneTestTwoAnnotations
+[INFO] Tests run: 1, Failures: 0, Errors: 0, Skipped: 0, Time elapsed: 0 s - in org.junit.tests.experimental.theories.runner.SuccessfulWithDataPointFields$OneTestTwoAnnotations
 [INFO] Running org.junit.tests.experimental.theories.runner.SuccessfulWithDataPointFields$BeforeAndAfterEachTime
 [INFO] Tests run: 1, Failures: 0, Errors: 0, Skipped: 0, Time elapsed: 0 s - in org.junit.tests.experimental.theories.runner.SuccessfulWithDataPointFields$BeforeAndAfterEachTime
 [INFO] Running org.junit.tests.experimental.theories.runner.SuccessfulWithDataPointFields$DifferentTypesInConstructor
-[INFO] Tests run: 1, Failures: 0, Errors: 0, Skipped: 0, Time elapsed: 0 s - in org.junit.tests.experimental.theories.runner.SuccessfulWithDataPointFields$DifferentTypesInConstructor
+[INFO] Tests run: 1, Failures: 0, Errors: 0, Skipped: 0, Time elapsed: 0.001 s - in org.junit.tests.experimental.theories.runner.SuccessfulWithDataPointFields$DifferentTypesInConstructor
 [INFO] Running org.junit.tests.experimental.theories.runner.SuccessfulWithDataPointFields$PositiveIntsWithMethodParams
-[INFO] Tests run: 1, Failures: 0, Errors: 0, Skipped: 0, Time elapsed: 0 s - in org.junit.tests.experimental.theories.runner.SuccessfulWithDataPointFields$PositiveIntsWithMethodParams
+[INFO] Tests run: 1, Failures: 0, Errors: 0, Skipped: 0, Time elapsed: 0.001 s - in org.junit.tests.experimental.theories.runner.SuccessfulWithDataPointFields$PositiveIntsWithMethodParams
 [INFO] Running org.junit.tests.experimental.theories.runner.SuccessfulWithDataPointFields$PositiveIntsWithNegativeField
 [INFO] Tests run: 1, Failures: 0, Errors: 0, Skipped: 0, Time elapsed: 0 s - in org.junit.tests.experimental.theories.runner.SuccessfulWithDataPointFields$PositiveIntsWithNegativeField
 [INFO] Running org.junit.tests.experimental.theories.runner.SuccessfulWithDataPointFields$PositiveInts
 [INFO] Tests run: 1, Failures: 0, Errors: 0, Skipped: 0, Time elapsed: 0.001 s - in org.junit.tests.experimental.theories.runner.SuccessfulWithDataPointFields$PositiveInts
 [INFO] Running org.junit.tests.experimental.theories.runner.SuccessfulWithDataPointFields$NewObjectEachTime
-[INFO] Tests run: 1, Failures: 0, Errors: 0, Skipped: 0, Time elapsed: 0 s - in org.junit.tests.experimental.theories.runner.SuccessfulWithDataPointFields$NewObjectEachTime
+[INFO] Tests run: 1, Failures: 0, Errors: 0, Skipped: 0, Time elapsed: 0.001 s - in org.junit.tests.experimental.theories.runner.SuccessfulWithDataPointFields$NewObjectEachTime
 [INFO] Running org.junit.tests.experimental.theories.runner.SuccessfulWithDataPointFields$BeforeAndAfterOnSameInstance
 [INFO] Tests run: 1, Failures: 0, Errors: 0, Skipped: 0, Time elapsed: 0.001 s - in org.junit.tests.experimental.theories.runner.SuccessfulWithDataPointFields$BeforeAndAfterOnSameInstance
 [INFO] Running org.junit.tests.experimental.theories.runner.SuccessfulWithDataPointFields$HasATwoParameterTheory
 [INFO] Tests run: 1, Failures: 0, Errors: 0, Skipped: 0, Time elapsed: 0 s - in org.junit.tests.experimental.theories.runner.SuccessfulWithDataPointFields$HasATwoParameterTheory
 [INFO] Running org.junit.tests.experimental.theories.runner.TheoriesPerformanceTest
-[WARNING] Tests run: 1, Failures: 0, Errors: 0, Skipped: 1, Time elapsed: 0 s - in org.junit.tests.experimental.theories.runner.TheoriesPerformanceTest
+[WARNING] Tests run: 1, Failures: 0, Errors: 0, Skipped: 1, Time elapsed: 0.001 s - in org.junit.tests.experimental.theories.runner.TheoriesPerformanceTest
 [INFO] Running org.junit.tests.experimental.theories.runner.TypeMatchingBetweenMultiDataPointsMethod
 [INFO] Tests run: 2, Failures: 0, Errors: 0, Skipped: 0, Time elapsed: 0.001 s - in org.junit.tests.experimental.theories.runner.TypeMatchingBetweenMultiDataPointsMethod
 [INFO] Running org.junit.tests.experimental.theories.runner.UnsuccessfulWithDataPointFields
-[INFO] Tests run: 10, Failures: 0, Errors: 0, Skipped: 0, Time elapsed: 0 s - in org.junit.tests.experimental.theories.runner.UnsuccessfulWithDataPointFields
+[INFO] Tests run: 10, Failures: 0, Errors: 0, Skipped: 0, Time elapsed: 0.066 s - in org.junit.tests.experimental.theories.runner.UnsuccessfulWithDataPointFields
 [INFO] Running org.junit.tests.experimental.theories.runner.WhenNoParametersMatch
-[INFO] Tests run: 1, Failures: 0, Errors: 0, Skipped: 0, Time elapsed: 0 s - in org.junit.tests.experimental.theories.runner.WhenNoParametersMatch
+[INFO] Tests run: 1, Failures: 0, Errors: 0, Skipped: 0, Time elapsed: 0.019 s - in org.junit.tests.experimental.theories.runner.WhenNoParametersMatch
 [INFO] Running org.junit.tests.experimental.theories.runner.WithAutoGeneratedDataPoints
-[INFO] Tests run: 4, Failures: 0, Errors: 0, Skipped: 0, Time elapsed: 0.001 s - in org.junit.tests.experimental.theories.runner.WithAutoGeneratedDataPoints
+[INFO] Tests run: 4, Failures: 0, Errors: 0, Skipped: 0, Time elapsed: 0.005 s - in org.junit.tests.experimental.theories.runner.WithAutoGeneratedDataPoints
 [INFO] Running org.junit.tests.experimental.theories.runner.WithDataPointMethod
-[INFO] Tests run: 4, Failures: 0, Errors: 0, Skipped: 0, Time elapsed: 0.013 s - in org.junit.tests.experimental.theories.runner.WithDataPointMethod
+[INFO] Tests run: 4, Failures: 0, Errors: 0, Skipped: 0, Time elapsed: 0.008 s - in org.junit.tests.experimental.theories.runner.WithDataPointMethod
 [INFO] Running org.junit.tests.experimental.theories.runner.WithExtendedParameterSources
-[INFO] Tests run: 8, Failures: 0, Errors: 0, Skipped: 0, Time elapsed: 0.022 s - in org.junit.tests.experimental.theories.runner.WithExtendedParameterSources
+[INFO] Tests run: 8, Failures: 0, Errors: 0, Skipped: 0, Time elapsed: 0.035 s - in org.junit.tests.experimental.theories.runner.WithExtendedParameterSources
 [INFO] Running org.junit.tests.experimental.theories.runner.WithNamedDataPoints
-[INFO] Tests run: 1, Failures: 0, Errors: 0, Skipped: 0, Time elapsed: 0.012 s - in org.junit.tests.experimental.theories.runner.WithNamedDataPoints
+[INFO] Tests run: 1, Failures: 0, Errors: 0, Skipped: 0, Time elapsed: 0.002 s - in org.junit.tests.experimental.theories.runner.WithNamedDataPoints
 [INFO] Running org.junit.tests.experimental.theories.runner.WithOnlyTestAnnotations
-[INFO] Tests run: 4, Failures: 0, Errors: 0, Skipped: 0, Time elapsed: 0.039 s - in org.junit.tests.experimental.theories.runner.WithOnlyTestAnnotations
+[INFO] Tests run: 4, Failures: 0, Errors: 0, Skipped: 0, Time elapsed: 0.014 s - in org.junit.tests.experimental.theories.runner.WithOnlyTestAnnotations
 [INFO] Running org.junit.tests.experimental.theories.runner.WithParameterSupplier
-[INFO] Tests run: 4, Failures: 0, Errors: 0, Skipped: 0, Time elapsed: 0.051 s - in org.junit.tests.experimental.theories.runner.WithParameterSupplier
+[INFO] Tests run: 4, Failures: 0, Errors: 0, Skipped: 0, Time elapsed: 0.011 s - in org.junit.tests.experimental.theories.runner.WithParameterSupplier
 [INFO] Running org.junit.tests.experimental.theories.runner.WithUnresolvedGenericTypeVariablesOnTheoryParms
-[INFO] Tests run: 9, Failures: 0, Errors: 0, Skipped: 0, Time elapsed: 0.159 s - in org.junit.tests.experimental.theories.runner.WithUnresolvedGenericTypeVariablesOnTheoryParms
+[INFO] Tests run: 9, Failures: 0, Errors: 0, Skipped: 0, Time elapsed: 0.051 s - in org.junit.tests.experimental.theories.runner.WithUnresolvedGenericTypeVariablesOnTheoryParms
 [INFO] Running org.junit.tests.experimental.theories.ParameterSignatureTest
-[INFO] Tests run: 5, Failures: 0, Errors: 0, Skipped: 0, Time elapsed: 0.013 s - in org.junit.tests.experimental.theories.ParameterSignatureTest
+[INFO] Tests run: 5, Failures: 0, Errors: 0, Skipped: 0, Time elapsed: 0 s - in org.junit.tests.experimental.theories.ParameterSignatureTest
 [INFO] Running org.junit.tests.experimental.theories.TestedOnSupplierTest
 [INFO] Tests run: 1, Failures: 0, Errors: 0, Skipped: 0, Time elapsed: 0 s - in org.junit.tests.experimental.theories.TestedOnSupplierTest
 [INFO] Running org.junit.tests.experimental.theories.AssumingInTheoriesTest
-[INFO] Tests run: 2, Failures: 0, Errors: 0, Skipped: 0, Time elapsed: 0.001 s - in org.junit.tests.experimental.theories.AssumingInTheoriesTest
+[INFO] Tests run: 2, Failures: 0, Errors: 0, Skipped: 0, Time elapsed: 0 s - in org.junit.tests.experimental.theories.AssumingInTheoriesTest
 [INFO] Running org.junit.tests.experimental.theories.PotentialAssignmentTest
 [INFO] Tests run: 4, Failures: 0, Errors: 0, Skipped: 0, Time elapsed: 0 s - in org.junit.tests.experimental.theories.PotentialAssignmentTest
 [INFO] Running org.junit.tests.experimental.AssumptionTest
-[INFO] Tests run: 20, Failures: 0, Errors: 0, Skipped: 0, Time elapsed: 0.045 s - in org.junit.tests.experimental.AssumptionTest
+[INFO] Tests run: 20, Failures: 0, Errors: 0, Skipped: 0, Time elapsed: 0.021 s - in org.junit.tests.experimental.AssumptionTest
 [INFO] Running org.junit.tests.experimental.MatcherTest
-[INFO] Tests run: 1, Failures: 0, Errors: 0, Skipped: 0, Time elapsed: 0 s - in org.junit.tests.experimental.MatcherTest
+[INFO] Tests run: 1, Failures: 0, Errors: 0, Skipped: 0, Time elapsed: 0.004 s - in org.junit.tests.experimental.MatcherTest
 [INFO] Running org.junit.tests.experimental.theories.extendingwithstubs.StubbedTheoriesTest
-[INFO] Tests run: 1, Failures: 0, Errors: 0, Skipped: 0, Time elapsed: 0.032 s - in org.junit.tests.experimental.theories.extendingwithstubs.StubbedTheoriesTest
+[INFO] Tests run: 1, Failures: 0, Errors: 0, Skipped: 0, Time elapsed: 0.014 s - in org.junit.tests.experimental.theories.extendingwithstubs.StubbedTheoriesTest
 [INFO] Running org.junit.internal.builders.AnnotatedBuilderTest
-[INFO] Tests run: 6, Failures: 0, Errors: 0, Skipped: 0, Time elapsed: 0.012 s - in org.junit.internal.builders.AnnotatedBuilderTest
+[INFO] Tests run: 6, Failures: 0, Errors: 0, Skipped: 0, Time elapsed: 0.004 s - in org.junit.internal.builders.AnnotatedBuilderTest
 [INFO] Running org.junit.internal.ChecksTest
-[INFO] Tests run: 5, Failures: 0, Errors: 0, Skipped: 0, Time elapsed: 0.006 s - in org.junit.internal.ChecksTest
+[INFO] Tests run: 5, Failures: 0, Errors: 0, Skipped: 0, Time elapsed: 0.001 s - in org.junit.internal.ChecksTest
 [INFO] Running org.junit.internal.runners.ErrorReportingRunnerTest
-[INFO] Tests run: 6, Failures: 0, Errors: 0, Skipped: 0, Time elapsed: 0.026 s - in org.junit.internal.runners.ErrorReportingRunnerTest
+[INFO] Tests run: 6, Failures: 0, Errors: 0, Skipped: 0, Time elapsed: 0 s - in org.junit.internal.runners.ErrorReportingRunnerTest
 [INFO] Running org.junit.internal.runners.statements.ExpectExceptionTest
-[INFO] Tests run: 4, Failures: 0, Errors: 0, Skipped: 0, Time elapsed: 0 s - in org.junit.internal.runners.statements.ExpectExceptionTest
+[INFO] Tests run: 4, Failures: 0, Errors: 0, Skipped: 0, Time elapsed: 0.001 s - in org.junit.internal.runners.statements.ExpectExceptionTest
 [INFO] Running org.junit.internal.runners.statements.FailOnTimeoutTest
-[WARNING] Tests run: 20, Failures: 0, Errors: 0, Skipped: 2, Time elapsed: 0.878 s - in org.junit.internal.runners.statements.FailOnTimeoutTest
+[WARNING] Tests run: 20, Failures: 0, Errors: 0, Skipped: 2, Time elapsed: 0.656 s - in org.junit.internal.runners.statements.FailOnTimeoutTest
 [INFO] Running org.junit.internal.MethodSorterTest
-[INFO] Tests run: 6, Failures: 0, Errors: 0, Skipped: 0, Time elapsed: 0.041 s - in org.junit.internal.MethodSorterTest
+[INFO] Tests run: 6, Failures: 0, Errors: 0, Skipped: 0, Time elapsed: 0.016 s - in org.junit.internal.MethodSorterTest
 [INFO] Running org.junit.internal.matchers.StacktracePrintingMatcherTest
-[INFO] Tests run: 3, Failures: 0, Errors: 0, Skipped: 0, Time elapsed: 0.004 s - in org.junit.internal.matchers.StacktracePrintingMatcherTest
+[INFO] Tests run: 3, Failures: 0, Errors: 0, Skipped: 0, Time elapsed: 0.003 s - in org.junit.internal.matchers.StacktracePrintingMatcherTest
 [INFO] Running org.junit.internal.StackTracesTest
-[INFO] Tests run: 9, Failures: 0, Errors: 0, Skipped: 0, Time elapsed: 0.246 s - in org.junit.internal.StackTracesTest
+[INFO] Tests run: 9, Failures: 0, Errors: 0, Skipped: 0, Time elapsed: 0.052 s - in org.junit.internal.StackTracesTest
 [INFO] Running org.junit.internal.matchers.ThrowableCauseMatcherTest
 [INFO] Tests run: 1, Failures: 0, Errors: 0, Skipped: 0, Time elapsed: 0 s - in org.junit.internal.matchers.ThrowableCauseMatcherTest
 [INFO] Running org.junit.internal.ArrayComparisonFailureTest
-[INFO] Tests run: 2, Failures: 0, Errors: 0, Skipped: 0, Time elapsed: 0.085 s - in org.junit.internal.ArrayComparisonFailureTest
+[INFO] Tests run: 2, Failures: 0, Errors: 0, Skipped: 0, Time elapsed: 0.04 s - in org.junit.internal.ArrayComparisonFailureTest
 [INFO] Running org.junit.tests.junit3compatibility.AllTestsTest
-[INFO] Tests run: 5, Failures: 0, Errors: 0, Skipped: 0, Time elapsed: 0.016 s - in org.junit.tests.junit3compatibility.AllTestsTest
+[INFO] Tests run: 5, Failures: 0, Errors: 0, Skipped: 0, Time elapsed: 0.024 s - in org.junit.tests.junit3compatibility.AllTestsTest
 [INFO] Running org.junit.tests.junit3compatibility.ClassRequestTest
 [INFO] Tests run: 1, Failures: 0, Errors: 0, Skipped: 0, Time elapsed: 0 s - in org.junit.tests.junit3compatibility.ClassRequestTest
 [INFO] Running org.junit.tests.junit3compatibility.ForwardCompatibilityPrintingTest
-[INFO] Tests run: 2, Failures: 0, Errors: 0, Skipped: 0, Time elapsed: 0 s - in org.junit.tests.junit3compatibility.ForwardCompatibilityPrintingTest
+[INFO] Tests run: 2, Failures: 0, Errors: 0, Skipped: 0, Time elapsed: 0.001 s - in org.junit.tests.junit3compatibility.ForwardCompatibilityPrintingTest
 [INFO] Running org.junit.tests.junit3compatibility.ForwardCompatibilityTest
-[INFO] Tests run: 12, Failures: 0, Errors: 0, Skipped: 0, Time elapsed: 0.011 s - in org.junit.tests.junit3compatibility.ForwardCompatibilityTest
+[INFO] Tests run: 12, Failures: 0, Errors: 0, Skipped: 0, Time elapsed: 0.001 s - in org.junit.tests.junit3compatibility.ForwardCompatibilityTest
 [INFO] Running org.junit.tests.junit3compatibility.InitializationErrorForwardCompatibilityTest
-[INFO] Tests run: 3, Failures: 0, Errors: 0, Skipped: 0, Time elapsed: 0.02 s - in org.junit.tests.junit3compatibility.InitializationErrorForwardCompatibilityTest
+[INFO] Tests run: 3, Failures: 0, Errors: 0, Skipped: 0, Time elapsed: 0.001 s - in org.junit.tests.junit3compatibility.InitializationErrorForwardCompatibilityTest
 [INFO] Running org.junit.tests.junit3compatibility.JUnit38ClassRunnerTest
-[INFO] Tests run: 7, Failures: 0, Errors: 0, Skipped: 0, Time elapsed: 0.05 s - in org.junit.tests.junit3compatibility.JUnit38ClassRunnerTest
+[INFO] Tests run: 7, Failures: 0, Errors: 0, Skipped: 0, Time elapsed: 0.001 s - in org.junit.tests.junit3compatibility.JUnit38ClassRunnerTest
 [INFO] Running org.junit.tests.junit3compatibility.JUnit4TestAdapterTest
-[INFO] Tests run: 3, Failures: 0, Errors: 0, Skipped: 0, Time elapsed: 0.058 s - in org.junit.tests.junit3compatibility.JUnit4TestAdapterTest
+[INFO] Tests run: 3, Failures: 0, Errors: 0, Skipped: 0, Time elapsed: 0.005 s - in org.junit.tests.junit3compatibility.JUnit4TestAdapterTest
 [INFO] Running org.junit.tests.junit3compatibility.OldTestClassAdaptingListenerTest
 [INFO] Tests run: 1, Failures: 0, Errors: 0, Skipped: 0, Time elapsed: 0 s - in org.junit.tests.junit3compatibility.OldTestClassAdaptingListenerTest
 [INFO] Running junit.tests.framework.TestCaseTest
-[INFO] Tests run: 14, Failures: 0, Errors: 0, Skipped: 0, Time elapsed: 0.011 s - in junit.tests.framework.TestCaseTest
+[INFO] Tests run: 14, Failures: 0, Errors: 0, Skipped: 0, Time elapsed: 0 s - in junit.tests.framework.TestCaseTest
 [INFO] Running junit.tests.framework.SuiteTest
-[INFO] Tests run: 11, Failures: 0, Errors: 0, Skipped: 0, Time elapsed: 0.068 s - in junit.tests.framework.SuiteTest
+[INFO] Tests run: 11, Failures: 0, Errors: 0, Skipped: 0, Time elapsed: 0.001 s - in junit.tests.framework.SuiteTest
 [INFO] Running junit.tests.framework.TestListenerTest
-[INFO] Tests run: 3, Failures: 0, Errors: 0, Skipped: 0, Time elapsed: 0.001 s - in junit.tests.framework.TestListenerTest
+[INFO] Tests run: 3, Failures: 0, Errors: 0, Skipped: 0, Time elapsed: 0 s - in junit.tests.framework.TestListenerTest
 [INFO] Running junit.tests.framework.AssertionFailedErrorTest
-[INFO] Tests run: 3, Failures: 0, Errors: 0, Skipped: 0, Time elapsed: 0 s - in junit.tests.framework.AssertionFailedErrorTest
+[INFO] Tests run: 3, Failures: 0, Errors: 0, Skipped: 0, Time elapsed: 0.001 s - in junit.tests.framework.AssertionFailedErrorTest
 [INFO] Running junit.tests.framework.AssertTest
-[INFO] Tests run: 16, Failures: 0, Errors: 0, Skipped: 0, Time elapsed: 0.001 s - in junit.tests.framework.AssertTest
+[INFO] Tests run: 16, Failures: 0, Errors: 0, Skipped: 0, Time elapsed: 0 s - in junit.tests.framework.AssertTest
 [INFO] Running junit.tests.framework.TestImplementorTest
-[INFO] Tests run: 1, Failures: 0, Errors: 0, Skipped: 0, Time elapsed: 0 s - in junit.tests.framework.TestImplementorTest
+[INFO] Tests run: 1, Failures: 0, Errors: 0, Skipped: 0, Time elapsed: 0.001 s - in junit.tests.framework.TestImplementorTest
 [INFO] Running junit.tests.framework.NoArgTestCaseTest
 [INFO] Tests run: 1, Failures: 0, Errors: 0, Skipped: 0, Time elapsed: 0 s - in junit.tests.framework.NoArgTestCaseTest
 [INFO] Running junit.tests.framework.ComparisonCompactorTest
-[INFO] Tests run: 19, Failures: 0, Errors: 0, Skipped: 0, Time elapsed: 0.016 s - in junit.tests.framework.ComparisonCompactorTest
+[INFO] Tests run: 19, Failures: 0, Errors: 0, Skipped: 0, Time elapsed: 0.001 s - in junit.tests.framework.ComparisonCompactorTest
 [INFO] Running junit.tests.framework.ComparisonFailureTest
 [INFO] Tests run: 4, Failures: 0, Errors: 0, Skipped: 0, Time elapsed: 0 s - in junit.tests.framework.ComparisonFailureTest
 [INFO] Running junit.tests.framework.DoublePrecisionAssertTest
 [INFO] Tests run: 7, Failures: 0, Errors: 0, Skipped: 0, Time elapsed: 0 s - in junit.tests.framework.DoublePrecisionAssertTest
 [INFO] Running junit.tests.framework.FloatAssertTest
-[INFO] Tests run: 8, Failures: 0, Errors: 0, Skipped: 0, Time elapsed: 0.001 s - in junit.tests.framework.FloatAssertTest
+[INFO] Tests run: 8, Failures: 0, Errors: 0, Skipped: 0, Time elapsed: 0 s - in junit.tests.framework.FloatAssertTest
 [INFO] Running junit.tests.runner.StackFilterTest
 [INFO] Tests run: 1, Failures: 0, Errors: 0, Skipped: 0, Time elapsed: 0 s - in junit.tests.runner.StackFilterTest
 [INFO] Running junit.tests.runner.ResultTest
-[INFO] Tests run: 8, Failures: 0, Errors: 0, Skipped: 0, Time elapsed: 0.419 s - in junit.tests.runner.ResultTest
+[INFO] Tests run: 8, Failures: 0, Errors: 0, Skipped: 0, Time elapsed: 0.115 s - in junit.tests.runner.ResultTest
 [INFO] Running junit.tests.runner.BaseTestRunnerTest
 [INFO] Tests run: 2, Failures: 0, Errors: 0, Skipped: 0, Time elapsed: 0 s - in junit.tests.runner.BaseTestRunnerTest
 [INFO] Running junit.tests.runner.TextFeedbackTest
-[INFO] Tests run: 5, Failures: 0, Errors: 0, Skipped: 0, Time elapsed: 0.014 s - in junit.tests.runner.TextFeedbackTest
+[INFO] Tests run: 5, Failures: 0, Errors: 0, Skipped: 0, Time elapsed: 0.002 s - in junit.tests.runner.TextFeedbackTest
 [INFO] Running junit.tests.runner.TextRunnerSingleMethodTest
-[INFO] Tests run: 1, Failures: 0, Errors: 0, Skipped: 0, Time elapsed: 0 s - in junit.tests.runner.TextRunnerSingleMethodTest
+[INFO] Tests run: 1, Failures: 0, Errors: 0, Skipped: 0, Time elapsed: 0.001 s - in junit.tests.runner.TextRunnerSingleMethodTest
 [INFO] Running junit.tests.runner.TextRunnerTest
-[INFO] Tests run: 4, Failures: 0, Errors: 0, Skipped: 0, Time elapsed: 1.686 s - in junit.tests.runner.TextRunnerTest
+[INFO] Tests run: 4, Failures: 0, Errors: 0, Skipped: 0, Time elapsed: 0.617 s - in junit.tests.runner.TextRunnerTest
 [INFO] Running junit.tests.extensions.ExtensionTest
-[INFO] Tests run: 4, Failures: 0, Errors: 0, Skipped: 0, Time elapsed: 0.001 s - in junit.tests.extensions.ExtensionTest
+[INFO] Tests run: 4, Failures: 0, Errors: 0, Skipped: 0, Time elapsed: 0 s - in junit.tests.extensions.ExtensionTest
 [INFO] Running junit.tests.extensions.ActiveTestTest
-[INFO] Tests run: 4, Failures: 0, Errors: 0, Skipped: 0, Time elapsed: 2.725 s - in junit.tests.extensions.ActiveTestTest
+[INFO] Tests run: 4, Failures: 0, Errors: 0, Skipped: 0, Time elapsed: 0.169 s - in junit.tests.extensions.ActiveTestTest
 [INFO] Running junit.tests.extensions.RepeatedTestTest
 [INFO] Tests run: 4, Failures: 0, Errors: 0, Skipped: 0, Time elapsed: 0.001 s - in junit.tests.extensions.RepeatedTestTest
 [INFO] Running org.junit.tests.junit3compatibility.SuiteMethodTest
-[INFO] Tests run: 5, Failures: 0, Errors: 0, Skipped: 0, Time elapsed: 0 s - in org.junit.tests.junit3compatibility.SuiteMethodTest
+[INFO] Tests run: 5, Failures: 0, Errors: 0, Skipped: 0, Time elapsed: 0.004 s - in org.junit.tests.junit3compatibility.SuiteMethodTest
 [INFO] Running org.junit.tests.listening.ListenerTest
-[INFO] Tests run: 1, Failures: 0, Errors: 0, Skipped: 0, Time elapsed: 0 s - in org.junit.tests.listening.ListenerTest
+[INFO] Tests run: 1, Failures: 0, Errors: 0, Skipped: 0, Time elapsed: 0.001 s - in org.junit.tests.listening.ListenerTest
 [INFO] Running org.junit.tests.listening.RunnerTest
-[INFO] Tests run: 3, Failures: 0, Errors: 0, Skipped: 0, Time elapsed: 0 s - in org.junit.tests.listening.RunnerTest
+[INFO] Tests run: 3, Failures: 0, Errors: 0, Skipped: 0, Time elapsed: 0.003 s - in org.junit.tests.listening.RunnerTest
 [INFO] Running org.junit.tests.listening.TestListenerTest
-[INFO] Tests run: 3, Failures: 0, Errors: 0, Skipped: 0, Time elapsed: 0 s - in org.junit.tests.listening.TestListenerTest
+[INFO] Tests run: 3, Failures: 0, Errors: 0, Skipped: 0, Time elapsed: 0.002 s - in org.junit.tests.listening.TestListenerTest
 [INFO] Running org.junit.tests.listening.TextListenerTest
-[INFO] Tests run: 3, Failures: 0, Errors: 0, Skipped: 0, Time elapsed: 0.014 s - in org.junit.tests.listening.TextListenerTest
+[INFO] Tests run: 3, Failures: 0, Errors: 0, Skipped: 0, Time elapsed: 0.007 s - in org.junit.tests.listening.TextListenerTest
 [INFO] Running org.junit.tests.listening.UserStopTest
-[INFO] Tests run: 2, Failures: 0, Errors: 0, Skipped: 0, Time elapsed: 0 s - in org.junit.tests.listening.UserStopTest
+[INFO] Tests run: 2, Failures: 0, Errors: 0, Skipped: 0, Time elapsed: 0.001 s - in org.junit.tests.listening.UserStopTest
 [INFO] Running org.junit.tests.manipulation.FilterableTest
 [INFO] Tests run: 1, Failures: 0, Errors: 0, Skipped: 0, Time elapsed: 0.001 s - in org.junit.tests.manipulation.FilterableTest
 [INFO] Running org.junit.tests.manipulation.FilterTest
 [INFO] Tests run: 3, Failures: 0, Errors: 0, Skipped: 0, Time elapsed: 0 s - in org.junit.tests.manipulation.FilterTest
 [INFO] Running org.junit.tests.manipulation.OrderableTest$UnOrderableRunnersAreHandledWithoutCrashing
-[INFO] Tests run: 1, Failures: 0, Errors: 0, Skipped: 0, Time elapsed: 0.001 s - in org.junit.tests.manipulation.OrderableTest$UnOrderableRunnersAreHandledWithoutCrashing
+[INFO] Tests run: 1, Failures: 0, Errors: 0, Skipped: 0, Time elapsed: 0.005 s - in org.junit.tests.manipulation.OrderableTest$UnOrderableRunnersAreHandledWithoutCrashing
 [INFO] Running org.junit.tests.manipulation.OrderableTest$TestClassRunnerIsOrderableWithSuiteMethod
 [INFO] Tests run: 2, Failures: 0, Errors: 0, Skipped: 0, Time elapsed: 0.001 s - in org.junit.tests.manipulation.OrderableTest$TestClassRunnerIsOrderableWithSuiteMethod
 [INFO] Running org.junit.tests.manipulation.OrderableTest$TestOrderableClassRunnerIsSortable
-[INFO] Tests run: 2, Failures: 0, Errors: 0, Skipped: 0, Time elapsed: 0 s - in org.junit.tests.manipulation.OrderableTest$TestOrderableClassRunnerIsSortable
+[INFO] Tests run: 2, Failures: 0, Errors: 0, Skipped: 0, Time elapsed: 0.001 s - in org.junit.tests.manipulation.OrderableTest$TestOrderableClassRunnerIsSortable
 [INFO] Running org.junit.tests.manipulation.OrderableTest$TestClassRunnerIsOrderable
-[INFO] Tests run: 5, Failures: 0, Errors: 0, Skipped: 0, Time elapsed: 0 s - in org.junit.tests.manipulation.OrderableTest$TestClassRunnerIsOrderable
+[INFO] Tests run: 5, Failures: 0, Errors: 0, Skipped: 0, Time elapsed: 0.009 s - in org.junit.tests.manipulation.OrderableTest$TestClassRunnerIsOrderable
 [INFO] Running org.junit.tests.manipulation.OrderWithTest$UnOrderableRunnersAreHandledWithoutCrashing
-[INFO] Tests run: 1, Failures: 0, Errors: 0, Skipped: 0, Time elapsed: 0.001 s - in org.junit.tests.manipulation.OrderWithTest$UnOrderableRunnersAreHandledWithoutCrashing
+[INFO] Tests run: 1, Failures: 0, Errors: 0, Skipped: 0, Time elapsed: 0 s - in org.junit.tests.manipulation.OrderWithTest$UnOrderableRunnersAreHandledWithoutCrashing
 [INFO] Running org.junit.tests.manipulation.OrderWithTest$TestClassRunnerIsOrderableWithSuiteMethod
-[INFO] Tests run: 2, Failures: 0, Errors: 0, Skipped: 0, Time elapsed: 0.022 s - in org.junit.tests.manipulation.OrderWithTest$TestClassRunnerIsOrderableWithSuiteMethod
+[INFO] Tests run: 2, Failures: 0, Errors: 0, Skipped: 0, Time elapsed: 0.011 s - in org.junit.tests.manipulation.OrderWithTest$TestClassRunnerIsOrderableWithSuiteMethod
 [INFO] Running org.junit.tests.manipulation.OrderWithTest$TestClassRunnerIsSortableViaOrderWith
-[INFO] Tests run: 2, Failures: 0, Errors: 0, Skipped: 0, Time elapsed: 0.029 s - in org.junit.tests.manipulation.OrderWithTest$TestClassRunnerIsSortableViaOrderWith
+[INFO] Tests run: 2, Failures: 0, Errors: 0, Skipped: 0, Time elapsed: 0.002 s - in org.junit.tests.manipulation.OrderWithTest$TestClassRunnerIsSortableViaOrderWith
 [INFO] Running org.junit.tests.manipulation.OrderWithTest$TestClassRunnerIsOrderableViaOrderWith
-[INFO] Tests run: 4, Failures: 0, Errors: 0, Skipped: 0, Time elapsed: 0.052 s - in org.junit.tests.manipulation.OrderWithTest$TestClassRunnerIsOrderableViaOrderWith
+[INFO] Tests run: 4, Failures: 0, Errors: 0, Skipped: 0, Time elapsed: 0.012 s - in org.junit.tests.manipulation.OrderWithTest$TestClassRunnerIsOrderableViaOrderWith
 [INFO] Running org.junit.tests.manipulation.SingleMethodTest
-[INFO] Tests run: 8, Failures: 0, Errors: 0, Skipped: 0, Time elapsed: 0.06 s - in org.junit.tests.manipulation.SingleMethodTest
+[INFO] Tests run: 8, Failures: 0, Errors: 0, Skipped: 0, Time elapsed: 0.012 s - in org.junit.tests.manipulation.SingleMethodTest
 [INFO] Running org.junit.tests.manipulation.SortableTest$TestOnlySortableClassRunnerIsSortable
-[INFO] Tests run: 2, Failures: 0, Errors: 0, Skipped: 0, Time elapsed: 0.015 s - in org.junit.tests.manipulation.SortableTest$TestOnlySortableClassRunnerIsSortable
+[INFO] Tests run: 2, Failures: 0, Errors: 0, Skipped: 0, Time elapsed: 0 s - in org.junit.tests.manipulation.SortableTest$TestOnlySortableClassRunnerIsSortable
 [INFO] Running org.junit.tests.manipulation.SortableTest$UnsortableRunnersAreHandledWithoutCrashing
-[INFO] Tests run: 1, Failures: 0, Errors: 0, Skipped: 0, Time elapsed: 0 s - in org.junit.tests.manipulation.SortableTest$UnsortableRunnersAreHandledWithoutCrashing
+[INFO] Tests run: 1, Failures: 0, Errors: 0, Skipped: 0, Time elapsed: 0.001 s - in org.junit.tests.manipulation.SortableTest$UnsortableRunnersAreHandledWithoutCrashing
 [INFO] Running org.junit.tests.manipulation.SortableTest$TestClassRunnerIsSortableWithSuiteMethod
-[INFO] Tests run: 2, Failures: 0, Errors: 0, Skipped: 0, Time elapsed: 0.001 s - in org.junit.tests.manipulation.SortableTest$TestClassRunnerIsSortableWithSuiteMethod
+[INFO] Tests run: 2, Failures: 0, Errors: 0, Skipped: 0, Time elapsed: 0 s - in org.junit.tests.manipulation.SortableTest$TestClassRunnerIsSortableWithSuiteMethod
 [INFO] Running org.junit.tests.manipulation.SortableTest$TestClassRunnerIsSortable
-[INFO] Tests run: 5, Failures: 0, Errors: 0, Skipped: 0, Time elapsed: 0.035 s - in org.junit.tests.manipulation.SortableTest$TestClassRunnerIsSortable
+[INFO] Tests run: 5, Failures: 0, Errors: 0, Skipped: 0, Time elapsed: 0.007 s - in org.junit.tests.manipulation.SortableTest$TestClassRunnerIsSortable
 [INFO] Running org.junit.rules.BlockJUnit4ClassRunnerOverrideTest
-[INFO] Tests run: 4, Failures: 0, Errors: 0, Skipped: 0, Time elapsed: 0.056 s - in org.junit.rules.BlockJUnit4ClassRunnerOverrideTest
+[INFO] Tests run: 4, Failures: 0, Errors: 0, Skipped: 0, Time elapsed: 0.012 s - in org.junit.rules.BlockJUnit4ClassRunnerOverrideTest
 [INFO] Running org.junit.rules.ClassRulesTest
-[INFO] Tests run: 12, Failures: 0, Errors: 0, Skipped: 0, Time elapsed: 0.124 s - in org.junit.rules.ClassRulesTest
+[INFO] Tests run: 12, Failures: 0, Errors: 0, Skipped: 0, Time elapsed: 0.026 s - in org.junit.rules.ClassRulesTest
 [INFO] Running org.junit.rules.DisableOnDebugTest
-[INFO] Tests run: 8, Failures: 0, Errors: 0, Skipped: 0, Time elapsed: 0.035 s - in org.junit.rules.DisableOnDebugTest
+[INFO] Tests run: 8, Failures: 0, Errors: 0, Skipped: 0, Time elapsed: 0.006 s - in org.junit.rules.DisableOnDebugTest
 [INFO] Running org.junit.rules.ErrorCollectorTest
-[INFO] Tests run: 18, Failures: 0, Errors: 0, Skipped: 0, Time elapsed: 0.143 s - in org.junit.rules.ErrorCollectorTest
+[INFO] Tests run: 18, Failures: 0, Errors: 0, Skipped: 0, Time elapsed: 0.032 s - in org.junit.rules.ErrorCollectorTest
 [INFO] Running org.junit.rules.ExpectedExceptionTest
-[INFO] Tests run: 23, Failures: 0, Errors: 0, Skipped: 0, Time elapsed: 0.119 s - in org.junit.rules.ExpectedExceptionTest
+[INFO] Tests run: 23, Failures: 0, Errors: 0, Skipped: 0, Time elapsed: 0.035 s - in org.junit.rules.ExpectedExceptionTest
 [INFO] Running org.junit.rules.ExternalResourceRuleTest
-[INFO] Tests run: 4, Failures: 0, Errors: 0, Skipped: 0, Time elapsed: 0.023 s - in org.junit.rules.ExternalResourceRuleTest
+[INFO] Tests run: 4, Failures: 0, Errors: 0, Skipped: 0, Time elapsed: 0.003 s - in org.junit.rules.ExternalResourceRuleTest
 [INFO] Running org.junit.rules.MethodRulesTest
-[INFO] Tests run: 15, Failures: 0, Errors: 0, Skipped: 0, Time elapsed: 0.094 s - in org.junit.rules.MethodRulesTest
+[INFO] Tests run: 15, Failures: 0, Errors: 0, Skipped: 0, Time elapsed: 0.035 s - in org.junit.rules.MethodRulesTest
 [INFO] Running org.junit.rules.NameRulesTest$BeforeAndAfterTest
-[INFO] Tests run: 1, Failures: 0, Errors: 0, Skipped: 0, Time elapsed: 0 s - in org.junit.rules.NameRulesTest$BeforeAndAfterTest
+[INFO] Tests run: 1, Failures: 0, Errors: 0, Skipped: 0, Time elapsed: 0.003 s - in org.junit.rules.NameRulesTest$BeforeAndAfterTest
 [INFO] Running org.junit.rules.NameRulesTest$TestNames
 [INFO] Tests run: 2, Failures: 0, Errors: 0, Skipped: 0, Time elapsed: 0 s - in org.junit.rules.NameRulesTest$TestNames
 [INFO] Running org.junit.rules.RuleChainTest
-[INFO] Tests run: 3, Failures: 0, Errors: 0, Skipped: 0, Time elapsed: 0.014 s - in org.junit.rules.RuleChainTest
+[INFO] Tests run: 3, Failures: 0, Errors: 0, Skipped: 0, Time elapsed: 0.002 s - in org.junit.rules.RuleChainTest
 [INFO] Running org.junit.rules.RuleMemberValidatorTest
-[INFO] Tests run: 21, Failures: 0, Errors: 0, Skipped: 0, Time elapsed: 0.041 s - in org.junit.rules.RuleMemberValidatorTest
+[INFO] Tests run: 21, Failures: 0, Errors: 0, Skipped: 0, Time elapsed: 0.013 s - in org.junit.rules.RuleMemberValidatorTest
 [INFO] Running org.junit.rules.StopwatchTest
-[INFO] Tests run: 5, Failures: 0, Errors: 0, Skipped: 0, Time elapsed: 0.037 s - in org.junit.rules.StopwatchTest
+[INFO] Tests run: 5, Failures: 0, Errors: 0, Skipped: 0, Time elapsed: 0.012 s - in org.junit.rules.StopwatchTest
 [INFO] Running org.junit.rules.TempFolderRuleTest
-[INFO] Tests run: 10, Failures: 0, Errors: 0, Skipped: 0, Time elapsed: 0.14 s - in org.junit.rules.TempFolderRuleTest
+[INFO] Tests run: 10, Failures: 0, Errors: 0, Skipped: 0, Time elapsed: 0.052 s - in org.junit.rules.TempFolderRuleTest
 [INFO] Running org.junit.rules.TemporaryFolderRuleAssuredDeletionTest
-[INFO] Tests run: 2, Failures: 0, Errors: 0, Skipped: 0, Time elapsed: 0.013 s - in org.junit.rules.TemporaryFolderRuleAssuredDeletionTest
+[INFO] Tests run: 2, Failures: 0, Errors: 0, Skipped: 0, Time elapsed: 0.002 s - in org.junit.rules.TemporaryFolderRuleAssuredDeletionTest
 [INFO] Running org.junit.rules.TemporaryFolderUsageTest
-[INFO] Tests run: 24, Failures: 0, Errors: 0, Skipped: 0, Time elapsed: 0.043 s - in org.junit.rules.TemporaryFolderUsageTest
+[INFO] Tests run: 24, Failures: 0, Errors: 0, Skipped: 0, Time elapsed: 0.021 s - in org.junit.rules.TemporaryFolderUsageTest
 [INFO] Running org.junit.rules.TestRuleTest
-[INFO] Tests run: 25, Failures: 0, Errors: 0, Skipped: 0, Time elapsed: 0.129 s - in org.junit.rules.TestRuleTest
+[INFO] Tests run: 25, Failures: 0, Errors: 0, Skipped: 0, Time elapsed: 0.053 s - in org.junit.rules.TestRuleTest
 [INFO] Running org.junit.rules.TestWatcherTest$InterplayWithOtherRules
-[INFO] Tests run: 2, Failures: 0, Errors: 0, Skipped: 0, Time elapsed: 0.009 s - in org.junit.rules.TestWatcherTest$InterplayWithOtherRules
+[INFO] Tests run: 2, Failures: 0, Errors: 0, Skipped: 0, Time elapsed: 0.001 s - in org.junit.rules.TestWatcherTest$InterplayWithOtherRules
 [INFO] Running org.junit.rules.TestWatcherTest$CallbackArguments
-[INFO] Tests run: 6, Failures: 0, Errors: 0, Skipped: 0, Time elapsed: 0.032 s - in org.junit.rules.TestWatcherTest$CallbackArguments
+[INFO] Tests run: 6, Failures: 0, Errors: 0, Skipped: 0, Time elapsed: 0.005 s - in org.junit.rules.TestWatcherTest$CallbackArguments
 [INFO] Running org.junit.rules.TestWatcherTest$Callbacks
-[INFO] Tests run: 12, Failures: 0, Errors: 0, Skipped: 0, Time elapsed: 0.124 s - in org.junit.rules.TestWatcherTest$Callbacks
+[INFO] Tests run: 12, Failures: 0, Errors: 0, Skipped: 0, Time elapsed: 0.06 s - in org.junit.rules.TestWatcherTest$Callbacks
 [INFO] Running org.junit.rules.TestWatchmanTest
-[INFO] Tests run: 4, Failures: 0, Errors: 0, Skipped: 0, Time elapsed: 0.026 s - in org.junit.rules.TestWatchmanTest
+[INFO] Tests run: 4, Failures: 0, Errors: 0, Skipped: 0, Time elapsed: 0.003 s - in org.junit.rules.TestWatchmanTest
 [INFO] Running org.junit.rules.TimeoutRuleTest
-[INFO] Tests run: 3, Failures: 0, Errors: 0, Skipped: 0, Time elapsed: 2.244 s - in org.junit.rules.TimeoutRuleTest
+[INFO] Tests run: 3, Failures: 0, Errors: 0, Skipped: 0, Time elapsed: 2.031 s - in org.junit.rules.TimeoutRuleTest
 [INFO] Running org.junit.rules.VerifierRuleTest
 [INFO] Tests run: 1, Failures: 0, Errors: 0, Skipped: 0, Time elapsed: 0 s - in org.junit.rules.VerifierRuleTest
 [INFO] Running org.junit.runners.model.FrameworkFieldTest
-[INFO] Tests run: 4, Failures: 0, Errors: 0, Skipped: 0, Time elapsed: 0.005 s - in org.junit.runners.model.FrameworkFieldTest
+[INFO] Tests run: 4, Failures: 0, Errors: 0, Skipped: 0, Time elapsed: 0 s - in org.junit.runners.model.FrameworkFieldTest
 [INFO] Running org.junit.runners.model.FrameworkMethodTest
-[INFO] Tests run: 4, Failures: 0, Errors: 0, Skipped: 0, Time elapsed: 0.004 s - in org.junit.runners.model.FrameworkMethodTest
+[INFO] Tests run: 4, Failures: 0, Errors: 0, Skipped: 0, Time elapsed: 0 s - in org.junit.runners.model.FrameworkMethodTest
 [INFO] Running org.junit.runners.model.InvalidTestClassErrorTest
 [INFO] Tests run: 1, Failures: 0, Errors: 0, Skipped: 0, Time elapsed: 0 s - in org.junit.runners.model.InvalidTestClassErrorTest
 [INFO] Running org.junit.runners.model.TestClassTest
-[INFO] Tests run: 20, Failures: 0, Errors: 0, Skipped: 0, Time elapsed: 0.033 s - in org.junit.runners.model.TestClassTest
+[INFO] Tests run: 20, Failures: 0, Errors: 0, Skipped: 0, Time elapsed: 0.016 s - in org.junit.runners.model.TestClassTest
 [INFO] Running org.junit.runners.parameterized.BlockJUnit4ClassRunnerWithParametersTest
-[INFO] Tests run: 2, Failures: 0, Errors: 0, Skipped: 0, Time elapsed: 0.011 s - in org.junit.runners.parameterized.BlockJUnit4ClassRunnerWithParametersTest
+[INFO] Tests run: 2, Failures: 0, Errors: 0, Skipped: 0, Time elapsed: 0.003 s - in org.junit.runners.parameterized.BlockJUnit4ClassRunnerWithParametersTest
 [INFO] Running org.junit.runners.parameterized.ParameterizedNamesTest
-[INFO] Tests run: 1, Failures: 0, Errors: 0, Skipped: 0, Time elapsed: 0.013 s - in org.junit.runners.parameterized.ParameterizedNamesTest
+[INFO] Tests run: 1, Failures: 0, Errors: 0, Skipped: 0, Time elapsed: 0.002 s - in org.junit.runners.parameterized.ParameterizedNamesTest
 [INFO] Running org.junit.runners.parameterized.TestWithParametersTest
-[INFO] Tests run: 12, Failures: 0, Errors: 0, Skipped: 0, Time elapsed: 0.009 s - in org.junit.runners.parameterized.TestWithParametersTest
+[INFO] Tests run: 12, Failures: 0, Errors: 0, Skipped: 0, Time elapsed: 0.004 s - in org.junit.runners.parameterized.TestWithParametersTest
 [INFO] Running org.junit.runners.RuleContainerTest
 [INFO] Tests run: 4, Failures: 0, Errors: 0, Skipped: 0, Time elapsed: 0 s - in org.junit.runners.RuleContainerTest
 [INFO] Running org.junit.runners.CustomBlockJUnit4ClassRunnerTest
-[INFO] Tests run: 1, Failures: 0, Errors: 0, Skipped: 0, Time elapsed: 0 s - in org.junit.runners.CustomBlockJUnit4ClassRunnerTest
+[INFO] Tests run: 1, Failures: 0, Errors: 0, Skipped: 0, Time elapsed: 0.001 s - in org.junit.runners.CustomBlockJUnit4ClassRunnerTest
 [INFO] Running org.junit.runner.notification.ConcurrentRunNotifierTest
-[INFO] Tests run: 3, Failures: 0, Errors: 0, Skipped: 0, Time elapsed: 0.278 s - in org.junit.runner.notification.ConcurrentRunNotifierTest
+[INFO] Tests run: 3, Failures: 0, Errors: 0, Skipped: 0, Time elapsed: 0.128 s - in org.junit.runner.notification.ConcurrentRunNotifierTest
 [INFO] Running org.junit.runner.notification.RunNotifierTest
-[INFO] Tests run: 8, Failures: 0, Errors: 0, Skipped: 0, Time elapsed: 0.009 s - in org.junit.runner.notification.RunNotifierTest
+[INFO] Tests run: 8, Failures: 0, Errors: 0, Skipped: 0, Time elapsed: 0 s - in org.junit.runner.notification.RunNotifierTest
 [INFO] Running org.junit.runner.notification.SynchronizedRunListenerTest
-[INFO] Tests run: 5, Failures: 0, Errors: 0, Skipped: 0, Time elapsed: 0.001 s - in org.junit.runner.notification.SynchronizedRunListenerTest
+[INFO] Tests run: 5, Failures: 0, Errors: 0, Skipped: 0, Time elapsed: 0 s - in org.junit.runner.notification.SynchronizedRunListenerTest
 [INFO] Running org.junit.runner.FilterFactoriesTest
-[INFO] Tests run: 6, Failures: 0, Errors: 0, Skipped: 0, Time elapsed: 0.024 s - in org.junit.runner.FilterFactoriesTest
+[INFO] Tests run: 6, Failures: 0, Errors: 0, Skipped: 0, Time elapsed: 0.012 s - in org.junit.runner.FilterFactoriesTest
 [INFO] Running org.junit.runner.FilterOptionIntegrationTest
-[INFO] Tests run: 4, Failures: 0, Errors: 0, Skipped: 0, Time elapsed: 0.044 s - in org.junit.runner.FilterOptionIntegrationTest
+[INFO] Tests run: 4, Failures: 0, Errors: 0, Skipped: 0, Time elapsed: 0.015 s - in org.junit.runner.FilterOptionIntegrationTest
 [INFO] Running org.junit.runner.OrderWithValidatorTest
-[INFO] Tests run: 2, Failures: 0, Errors: 0, Skipped: 0, Time elapsed: 0.009 s - in org.junit.runner.OrderWithValidatorTest
+[INFO] Tests run: 2, Failures: 0, Errors: 0, Skipped: 0, Time elapsed: 0 s - in org.junit.runner.OrderWithValidatorTest
 [INFO] Running org.junit.runner.JUnitCommandLineParseResultTest
-[INFO] Tests run: 10, Failures: 0, Errors: 0, Skipped: 0, Time elapsed: 0.017 s - in org.junit.runner.JUnitCommandLineParseResultTest
+[INFO] Tests run: 10, Failures: 0, Errors: 0, Skipped: 0, Time elapsed: 0.003 s - in org.junit.runner.JUnitCommandLineParseResultTest
 [INFO] Running org.junit.runner.JUnitCoreTest
-[INFO] Tests run: 1, Failures: 0, Errors: 0, Skipped: 0, Time elapsed: 0.008 s - in org.junit.runner.JUnitCoreTest
+[INFO] Tests run: 1, Failures: 0, Errors: 0, Skipped: 0, Time elapsed: 0 s - in org.junit.runner.JUnitCoreTest
 [INFO] Running org.junit.runner.RequestTest
-[INFO] Tests run: 2, Failures: 0, Errors: 0, Skipped: 0, Time elapsed: 0.013 s - in org.junit.runner.RequestTest
+[INFO] Tests run: 2, Failures: 0, Errors: 0, Skipped: 0, Time elapsed: 0.001 s - in org.junit.runner.RequestTest
 [INFO] Running org.junit.tests.running.classes.BlockJUnit4ClassRunnerTest
-[INFO] Tests run: 2, Failures: 0, Errors: 0, Skipped: 0, Time elapsed: 0.013 s - in org.junit.tests.running.classes.BlockJUnit4ClassRunnerTest
+[INFO] Tests run: 2, Failures: 0, Errors: 0, Skipped: 0, Time elapsed: 0.001 s - in org.junit.tests.running.classes.BlockJUnit4ClassRunnerTest
 [INFO] Running org.junit.tests.running.classes.ClassLevelMethodsWithIgnoredTestsTest
-[INFO] Tests run: 5, Failures: 0, Errors: 0, Skipped: 0, Time elapsed: 0.033 s - in org.junit.tests.running.classes.ClassLevelMethodsWithIgnoredTestsTest
+[INFO] Tests run: 5, Failures: 0, Errors: 0, Skipped: 0, Time elapsed: 0.007 s - in org.junit.tests.running.classes.ClassLevelMethodsWithIgnoredTestsTest
 [INFO] Running org.junit.tests.running.classes.EnclosedTest
-[INFO] Tests run: 3, Failures: 0, Errors: 0, Skipped: 0, Time elapsed: 0.017 s - in org.junit.tests.running.classes.EnclosedTest
+[INFO] Tests run: 3, Failures: 0, Errors: 0, Skipped: 0, Time elapsed: 0.003 s - in org.junit.tests.running.classes.EnclosedTest
 [INFO] Running org.junit.tests.running.classes.IgnoreClassTest
-[INFO] Tests run: 1, Failures: 0, Errors: 0, Skipped: 0, Time elapsed: 0.005 s - in org.junit.tests.running.classes.IgnoreClassTest
+[INFO] Tests run: 1, Failures: 0, Errors: 0, Skipped: 0, Time elapsed: 0.004 s - in org.junit.tests.running.classes.IgnoreClassTest
 [INFO] Running org.junit.tests.running.classes.ParameterizedTestTest
-[INFO] Tests run: 28, Failures: 0, Errors: 0, Skipped: 0, Time elapsed: 0.261 s - in org.junit.tests.running.classes.ParameterizedTestTest
+[INFO] Tests run: 28, Failures: 0, Errors: 0, Skipped: 0, Time elapsed: 0.097 s - in org.junit.tests.running.classes.ParameterizedTestTest
 [INFO] Running org.junit.tests.running.classes.ParentRunnerFilteringTest
-[INFO] Tests run: 5, Failures: 0, Errors: 0, Skipped: 0, Time elapsed: 0.03 s - in org.junit.tests.running.classes.ParentRunnerFilteringTest
+[INFO] Tests run: 5, Failures: 0, Errors: 0, Skipped: 0, Time elapsed: 0.005 s - in org.junit.tests.running.classes.ParentRunnerFilteringTest
 [INFO] Running org.junit.tests.running.classes.ParentRunnerTest
-[INFO] Tests run: 8, Failures: 0, Errors: 0, Skipped: 0, Time elapsed: 0.02 s - in org.junit.tests.running.classes.ParentRunnerTest
+[INFO] Tests run: 8, Failures: 0, Errors: 0, Skipped: 0, Time elapsed: 0.011 s - in org.junit.tests.running.classes.ParentRunnerTest
 [INFO] Running org.junit.tests.running.classes.parent.ParentRunnerClassLoaderTest
-[INFO] Tests run: 3, Failures: 0, Errors: 0, Skipped: 0, Time elapsed: 0.016 s - in org.junit.tests.running.classes.parent.ParentRunnerClassLoaderTest
+[INFO] Tests run: 3, Failures: 0, Errors: 0, Skipped: 0, Time elapsed: 0.008 s - in org.junit.tests.running.classes.parent.ParentRunnerClassLoaderTest
 [INFO] Running org.junit.tests.running.classes.RunWithTest
-[INFO] Tests run: 3, Failures: 0, Errors: 0, Skipped: 0, Time elapsed: 0.016 s - in org.junit.tests.running.classes.RunWithTest
+[INFO] Tests run: 3, Failures: 0, Errors: 0, Skipped: 0, Time elapsed: 0 s - in org.junit.tests.running.classes.RunWithTest
 [INFO] Running org.junit.tests.running.classes.SuiteTest
-[INFO] Tests run: 15, Failures: 0, Errors: 0, Skipped: 0, Time elapsed: 0.081 s - in org.junit.tests.running.classes.SuiteTest
+[INFO] Tests run: 15, Failures: 0, Errors: 0, Skipped: 0, Time elapsed: 0.028 s - in org.junit.tests.running.classes.SuiteTest
 [INFO] Running org.junit.tests.running.classes.UseSuiteAsASuperclassTest
-[INFO] Tests run: 1, Failures: 0, Errors: 0, Skipped: 0, Time elapsed: 0.018 s - in org.junit.tests.running.classes.UseSuiteAsASuperclassTest
+[INFO] Tests run: 1, Failures: 0, Errors: 0, Skipped: 0, Time elapsed: 0.001 s - in org.junit.tests.running.classes.UseSuiteAsASuperclassTest
 [INFO] Running org.junit.tests.running.classes.ThreadsTest
 [INFO] Tests run: 2, Failures: 0, Errors: 0, Skipped: 0, Time elapsed: 0.005 s - in org.junit.tests.running.classes.ThreadsTest
 [INFO] Running org.junit.tests.running.core.CommandLineTest
-[INFO] Tests run: 4, Failures: 0, Errors: 0, Skipped: 0, Time elapsed: 0.193 s - in org.junit.tests.running.core.CommandLineTest
+[INFO] Tests run: 4, Failures: 0, Errors: 0, Skipped: 0, Time elapsed: 0.072 s - in org.junit.tests.running.core.CommandLineTest
 [INFO] Running org.junit.tests.running.core.JUnitCoreReturnsCorrectExitCodeTest
-[INFO] Tests run: 3, Failures: 0, Errors: 0, Skipped: 0, Time elapsed: 0.036 s - in org.junit.tests.running.core.JUnitCoreReturnsCorrectExitCodeTest
+[INFO] Tests run: 3, Failures: 0, Errors: 0, Skipped: 0, Time elapsed: 0.008 s - in org.junit.tests.running.core.JUnitCoreReturnsCorrectExitCodeTest
 [INFO] Running org.junit.tests.running.core.SystemExitTest
-[INFO] Tests run: 1, Failures: 0, Errors: 0, Skipped: 0, Time elapsed: 0.239 s - in org.junit.tests.running.core.SystemExitTest
+[INFO] Tests run: 1, Failures: 0, Errors: 0, Skipped: 0, Time elapsed: 0.083 s - in org.junit.tests.running.core.SystemExitTest
 [INFO] Running org.junit.tests.running.methods.AnnotationTest
-[INFO] Tests run: 30, Failures: 0, Errors: 0, Skipped: 0, Time elapsed: 0.196 s - in org.junit.tests.running.methods.AnnotationTest
+[INFO] Tests run: 30, Failures: 0, Errors: 0, Skipped: 0, Time elapsed: 0.053 s - in org.junit.tests.running.methods.AnnotationTest
 [INFO] Running org.junit.tests.running.methods.ExpectedTest
-[INFO] Tests run: 5, Failures: 0, Errors: 0, Skipped: 0, Time elapsed: 0.033 s - in org.junit.tests.running.methods.ExpectedTest
+[INFO] Tests run: 5, Failures: 0, Errors: 0, Skipped: 0, Time elapsed: 0.002 s - in org.junit.tests.running.methods.ExpectedTest
 [INFO] Running org.junit.tests.running.methods.InheritedTestTest
-[INFO] Tests run: 2, Failures: 0, Errors: 0, Skipped: 0, Time elapsed: 0.008 s - in org.junit.tests.running.methods.InheritedTestTest
+[INFO] Tests run: 2, Failures: 0, Errors: 0, Skipped: 0, Time elapsed: 0 s - in org.junit.tests.running.methods.InheritedTestTest
 [INFO] Running org.junit.tests.running.methods.ParameterizedTestMethodTest
-[INFO] Tests run: 3, Failures: 0, Errors: 0, Skipped: 0, Time elapsed: 0.004 s - in org.junit.tests.running.methods.ParameterizedTestMethodTest
+[INFO] Tests run: 3, Failures: 0, Errors: 0, Skipped: 0, Time elapsed: 0.002 s - in org.junit.tests.running.methods.ParameterizedTestMethodTest
 [INFO] Running org.junit.tests.running.methods.TestMethodTest
-[INFO] Tests run: 8, Failures: 0, Errors: 0, Skipped: 0, Time elapsed: 0.055 s - in org.junit.tests.running.methods.TestMethodTest
+[INFO] Tests run: 8, Failures: 0, Errors: 0, Skipped: 0, Time elapsed: 0.007 s - in org.junit.tests.running.methods.TestMethodTest
 [INFO] Running org.junit.tests.running.methods.TimeoutTest
-[WARNING] Tests run: 13, Failures: 0, Errors: 0, Skipped: 2, Time elapsed: 0.923 s - in org.junit.tests.running.methods.TimeoutTest
+[WARNING] Tests run: 13, Failures: 0, Errors: 0, Skipped: 2, Time elapsed: 0.731 s - in org.junit.tests.running.methods.TimeoutTest
 [INFO] Running org.junit.samples.ListTest
-[INFO] Tests run: 5, Failures: 0, Errors: 0, Skipped: 0, Time elapsed: 0.007 s - in org.junit.samples.ListTest
+[INFO] Tests run: 5, Failures: 0, Errors: 0, Skipped: 0, Time elapsed: 0.001 s - in org.junit.samples.ListTest
 [INFO] Running org.junit.samples.money.MoneyTest
-[INFO] Tests run: 23, Failures: 0, Errors: 0, Skipped: 0, Time elapsed: 0.012 s - in org.junit.samples.money.MoneyTest
+[INFO] Tests run: 23, Failures: 0, Errors: 0, Skipped: 0, Time elapsed: 0.003 s - in org.junit.samples.money.MoneyTest
 [INFO] Running org.junit.tests.validation.BadlyFormedClassesTest
-[INFO] Tests run: 3, Failures: 0, Errors: 0, Skipped: 0, Time elapsed: 0.014 s - in org.junit.tests.validation.BadlyFormedClassesTest
+[INFO] Tests run: 3, Failures: 0, Errors: 0, Skipped: 0, Time elapsed: 0.002 s - in org.junit.tests.validation.BadlyFormedClassesTest
 [INFO] Running org.junit.tests.validation.FailedConstructionTest
 [INFO] Tests run: 1, Failures: 0, Errors: 0, Skipped: 0, Time elapsed: 0 s - in org.junit.tests.validation.FailedConstructionTest
 [INFO] Running org.junit.tests.validation.ValidationTest
-[INFO] Tests run: 2, Failures: 0, Errors: 0, Skipped: 0, Time elapsed: 0.013 s - in org.junit.tests.validation.ValidationTest
+[INFO] Tests run: 2, Failures: 0, Errors: 0, Skipped: 0, Time elapsed: 0.001 s - in org.junit.tests.validation.ValidationTest
 [INFO] Running org.junit.validator.AnnotationsValidatorTest
-[INFO] Tests run: 3, Failures: 0, Errors: 0, Skipped: 0, Time elapsed: 0.011 s - in org.junit.validator.AnnotationsValidatorTest
+[INFO] Tests run: 3, Failures: 0, Errors: 0, Skipped: 0, Time elapsed: 0.005 s - in org.junit.validator.AnnotationsValidatorTest
 [INFO] Running org.junit.validator.AnnotationValidatorFactoryTest
-[INFO] Tests run: 2, Failures: 0, Errors: 0, Skipped: 0, Time elapsed: 0.019 s - in org.junit.validator.AnnotationValidatorFactoryTest
+[INFO] Tests run: 2, Failures: 0, Errors: 0, Skipped: 0, Time elapsed: 0.007 s - in org.junit.validator.AnnotationValidatorFactoryTest
 [INFO] Running org.junit.validator.PublicClassValidatorTest
-[INFO] Tests run: 2, Failures: 0, Errors: 0, Skipped: 0, Time elapsed: 0.011 s - in org.junit.validator.PublicClassValidatorTest
+[INFO] Tests run: 2, Failures: 0, Errors: 0, Skipped: 0, Time elapsed: 0.001 s - in org.junit.validator.PublicClassValidatorTest
 [INFO] Running org.junit.AssumptionViolatedExceptionTest
-[INFO] Tests run: 14, Failures: 0, Errors: 0, Skipped: 0, Time elapsed: 0.3 s - in org.junit.AssumptionViolatedExceptionTest
+[INFO] Tests run: 14, Failures: 0, Errors: 0, Skipped: 0, Time elapsed: 0.058 s - in org.junit.AssumptionViolatedExceptionTest
 [INFO] Running org.junit.tests.ObjectContractTest
-[INFO] Tests run: 2, Failures: 0, Errors: 0, Skipped: 0, Time elapsed: 0.041 s - in org.junit.tests.ObjectContractTest
+[INFO] Tests run: 2, Failures: 0, Errors: 0, Skipped: 0, Time elapsed: 0.004 s - in org.junit.tests.ObjectContractTest
 [INFO] 
 [INFO] Results:
 [INFO] 
@@ -5056,8 +5093,8 @@
 [INFO] ------------------------------------------------------------------------
 [INFO] BUILD SUCCESS
 [INFO] ------------------------------------------------------------------------
-[INFO] Total time:  35.630 s
-[INFO] Finished at: 2024-06-07T00:20:33-12:00
+[INFO] Total time:  22.363 s
+[INFO] Finished at: 2023-05-06T20:02:36+14:00
 [INFO] ------------------------------------------------------------------------
    create-stamp debian/debhelper-build-stamp
  fakeroot debian/rules binary
@@ -5085,15 +5122,15 @@
 [INFO] ------------------------------------------------------------------------
 [INFO] BUILD SUCCESS
 [INFO] ------------------------------------------------------------------------
-[INFO] Total time:  2.984 s
-[INFO] Finished at: 2024-06-07T00:20:43-12:00
+[INFO] Total time:  1.324 s
+[INFO] Finished at: 2023-05-06T20:02:41+14:00
 [INFO] ------------------------------------------------------------------------
 	mh_resolve_dependencies --non-interactive --offline --build -pjunit4 --javadoc --base-directory=/build/junit4-4.13.2 --non-explore
 Analysing pom.xml...
 > dpkg --search /usr/share/maven-repo/org/apache/maven/plugins/maven-install-plugin/*/* 
 dpkg failed to execute successfully
 Offline mode. Give up looking for package containing /usr/share/maven-repo/org/apache/maven/plugins/maven-install-plugin
-Jun 07, 2024 12:20:57 AM org.debian.maven.packager.DependenciesSolver$ToResolve resolve
+May 06, 2023 8:02:49 PM org.debian.maven.packager.DependenciesSolver$ToResolve resolve
 SEVERE: Cannot resolve dependencies in /build/junit4-4.13.2/pom.xml: Dependency not found org.apache.maven.plugins:maven-install-plugin:maven-plugin:2.5.2
 ERROR:
 pom.xml: plugin is not packaged in the Maven repository for Debian: org.apache.maven.plugins:maven-install-plugin:2.5.2
@@ -5139,8 +5176,8 @@
 dpkg-gencontrol: warning: package junit4-doc: substitution variable ${maven:DocDepends} unused, but is defined
    dh_md5sums
    dh_builddeb
-dpkg-deb: building package 'junit4' in '../junit4_4.13.2-3_all.deb'.
 dpkg-deb: building package 'junit4-doc' in '../junit4-doc_4.13.2-3_all.deb'.
+dpkg-deb: building package 'junit4' in '../junit4_4.13.2-3_all.deb'.
  dpkg-genbuildinfo --build=binary -O../junit4_4.13.2-3_arm64.buildinfo
  dpkg-genchanges --build=binary -O../junit4_4.13.2-3_arm64.changes
 dpkg-genchanges: info: binary-only upload (no source code included)
@@ -5148,12 +5185,14 @@
 dpkg-buildpackage: info: binary-only upload (no source included)
 dpkg-genchanges: info: not including original source code in upload
 I: copying local configuration
+I: user script /srv/workspace/pbuilder/28394/tmp/hooks/B01_cleanup starting
+I: user script /srv/workspace/pbuilder/28394/tmp/hooks/B01_cleanup finished
 I: unmounting dev/ptmx filesystem
 I: unmounting dev/pts filesystem
 I: unmounting dev/shm filesystem
 I: unmounting proc filesystem
 I: unmounting sys filesystem
 I: cleaning the build env 
-I: removing directory /srv/workspace/pbuilder/7658 and its subdirectories
-I: Current time: Fri Jun  7 00:21:46 -12 2024
-I: pbuilder-time-stamp: 1717762906
+I: removing directory /srv/workspace/pbuilder/28394 and its subdirectories
+I: Current time: Sat May  6 20:03:27 +14 2023
+I: pbuilder-time-stamp: 1683353007