Diff of the two buildlogs: -- --- b1/build.log 2021-11-30 12:58:35.611857353 +0000 +++ b2/build.log 2021-11-30 13:00:54.431127523 +0000 @@ -1,6 +1,6 @@ I: pbuilder: network access will be disabled during build -I: Current time: Tue Nov 30 00:49:04 -12 2021 -I: pbuilder-time-stamp: 1638276544 +I: Current time: Tue Jan 3 09:21:42 +14 2023 +I: pbuilder-time-stamp: 1672687302 I: Building the build Environment I: extracting base tarball [/var/cache/pbuilder/buster-reproducible-base.tgz] I: copying local configuration @@ -17,7 +17,7 @@ I: Extracting source gpgv: unknown type of key resource 'trustedkeys.kbx' gpgv: keyblock resource '/root/.gnupg/trustedkeys.kbx': General error -gpgv: Signature made Tue Jan 23 03:38:44 2018 -12 +gpgv: Signature made Wed Jan 24 05:38:44 2018 +14 gpgv: using RSA key 54EB6D089FA37C19A64590B3066DE8017E2B61D9 gpgv: issuer "absurd@debian.org" gpgv: Can't check signature: No public key @@ -32,136 +32,170 @@ dpkg-source: info: applying 0004-unrepr-also-from-__builtin__.patch I: using fakeroot in build. I: Installing the build-deps -I: user script /srv/workspace/pbuilder/2033725/tmp/hooks/D02_print_environment starting +I: user script /srv/workspace/pbuilder/3854983/tmp/hooks/D01_modify_environment starting +debug: Running on ionos15-amd64. +I: Changing host+domainname to test build reproducibility +I: Adding a custom variable just for the fun of it... +I: Changing /bin/sh to bash +Removing 'diversion of /bin/sh to /bin/sh.distrib by dash' +Adding 'diversion of /bin/sh to /bin/sh.distrib by bash' +Removing 'diversion of /usr/share/man/man1/sh.1.gz to /usr/share/man/man1/sh.distrib.1.gz by dash' +Adding 'diversion of /usr/share/man/man1/sh.1.gz to /usr/share/man/man1/sh.distrib.1.gz by bash' +I: Setting pbuilder2's login shell to /bin/bash +I: Setting pbuilder2's GECOS to second user,second room,second work-phone,second home-phone,second other +I: user script /srv/workspace/pbuilder/3854983/tmp/hooks/D01_modify_environment finished +I: user script /srv/workspace/pbuilder/3854983/tmp/hooks/D02_print_environment starting I: set - BUILDDIR='/build' - BUILDUSERGECOS='first user,first room,first work-phone,first home-phone,first other' - BUILDUSERNAME='pbuilder1' - BUILD_ARCH='amd64' - DEBIAN_FRONTEND='noninteractive' - DEB_BUILD_OPTIONS='buildinfo=+all reproducible=+all parallel=15' - DISTRIBUTION='' - HOME='/root' - HOST_ARCH='amd64' + BASH=/bin/sh + BASHOPTS=checkwinsize:cmdhist:complete_fullquote:extquote:force_fignore:globasciiranges:hostcomplete:interactive_comments:progcomp:promptvars:sourcepath + BASH_ALIASES=() + BASH_ARGC=() + BASH_ARGV=() + BASH_CMDS=() + BASH_LINENO=([0]="12" [1]="0") + BASH_SOURCE=([0]="/tmp/hooks/D02_print_environment" [1]="/tmp/hooks/D02_print_environment") + BASH_VERSINFO=([0]="5" [1]="0" [2]="3" [3]="1" [4]="release" [5]="x86_64-pc-linux-gnu") + BASH_VERSION='5.0.3(1)-release' + BUILDDIR=/build + BUILDUSERGECOS='second user,second room,second work-phone,second home-phone,second other' + BUILDUSERNAME=pbuilder2 + BUILD_ARCH=amd64 + DEBIAN_FRONTEND=noninteractive + DEB_BUILD_OPTIONS='buildinfo=+all reproducible=+all parallel=16' + DIRSTACK=() + DISTRIBUTION= + EUID=0 + FUNCNAME=([0]="Echo" [1]="main") + GROUPS=() + HOME=/root + HOSTNAME=i-capture-the-hostname + HOSTTYPE=x86_64 + HOST_ARCH=amd64 IFS=' ' - INVOCATION_ID='1740837e7e6048a8bb79e0999ca6349e' - LANG='C' - LANGUAGE='en_US:en' - LC_ALL='C' - MAIL='/var/mail/root' - OPTIND='1' - PATH='/usr/sbin:/usr/bin:/sbin:/bin:/usr/games' - PBCURRENTCOMMANDLINEOPERATION='build' - PBUILDER_OPERATION='build' - PBUILDER_PKGDATADIR='/usr/share/pbuilder' - PBUILDER_PKGLIBDIR='/usr/lib/pbuilder' - PBUILDER_SYSCONFDIR='/etc' - PPID='2033725' - PS1='# ' - PS2='> ' + INVOCATION_ID=c68cc80bb1db443db59a3d5676c7582f + LANG=C + LANGUAGE=et_EE:et + LC_ALL=C + MACHTYPE=x86_64-pc-linux-gnu + MAIL=/var/mail/root + OPTERR=1 + OPTIND=1 + OSTYPE=linux-gnu + PATH=/usr/sbin:/usr/bin:/sbin:/bin:/usr/games:/i/capture/the/path + PBCURRENTCOMMANDLINEOPERATION=build + PBUILDER_OPERATION=build + PBUILDER_PKGDATADIR=/usr/share/pbuilder + PBUILDER_PKGLIBDIR=/usr/lib/pbuilder + PBUILDER_SYSCONFDIR=/etc + PIPESTATUS=([0]="0") + POSIXLY_CORRECT=y + PPID=3854983 PS4='+ ' - PWD='/' - SHELL='/bin/bash' - SHLVL='2' - SUDO_COMMAND='/usr/bin/timeout -k 18.1h 18h /usr/bin/ionice -c 3 /usr/bin/nice /usr/sbin/pbuilder --build --configfile /srv/reproducible-results/rbuild-debian/tmp.9dCUW7LoCp/pbuilderrc_oRQK --hookdir /etc/pbuilder/first-build-hooks --debbuildopts -b --basetgz /var/cache/pbuilder/buster-reproducible-base.tgz --buildresult /srv/reproducible-results/rbuild-debian/tmp.9dCUW7LoCp/b1 --logfile b1/build.log cherrypy3_8.9.1-2.dsc' - SUDO_GID='110' - SUDO_UID='105' - SUDO_USER='jenkins' - TERM='unknown' - TZ='/usr/share/zoneinfo/Etc/GMT+12' - USER='root' - _='/usr/bin/systemd-run' - http_proxy='http://78.137.99.97:3128' + PWD=/ + SHELL=/bin/bash + SHELLOPTS=braceexpand:errexit:hashall:interactive-comments:posix + SHLVL=3 + SUDO_COMMAND='/usr/bin/timeout -k 24.1h 24h /usr/bin/ionice -c 3 /usr/bin/nice -n 11 /usr/bin/unshare --uts -- /usr/sbin/pbuilder --build --configfile /srv/reproducible-results/rbuild-debian/tmp.9dCUW7LoCp/pbuilderrc_rfPc --hookdir /etc/pbuilder/rebuild-hooks --debbuildopts -b --basetgz /var/cache/pbuilder/buster-reproducible-base.tgz --buildresult /srv/reproducible-results/rbuild-debian/tmp.9dCUW7LoCp/b2 --logfile b2/build.log cherrypy3_8.9.1-2.dsc' + SUDO_GID=111 + SUDO_UID=106 + SUDO_USER=jenkins + TERM=unknown + TZ=/usr/share/zoneinfo/Etc/GMT-14 + UID=0 + USER=root + _='I: set' + http_proxy=http://85.184.249.68:3128 I: uname -a - Linux ionos1-amd64 5.10.0-9-amd64 #1 SMP Debian 5.10.70-1 (2021-09-30) x86_64 GNU/Linux + Linux i-capture-the-hostname 5.14.0-0.bpo.2-amd64 #1 SMP Debian 5.14.9-2~bpo11+1 (2021-10-10) x86_64 GNU/Linux I: ls -l /bin total 5116 - -rwxr-xr-x 1 root root 1168776 Apr 17 2019 bash - -rwxr-xr-x 3 root root 38984 Jul 10 2019 bunzip2 - -rwxr-xr-x 3 root root 38984 Jul 10 2019 bzcat - lrwxrwxrwx 1 root root 6 Jul 10 2019 bzcmp -> bzdiff - -rwxr-xr-x 1 root root 2227 Jul 10 2019 bzdiff - lrwxrwxrwx 1 root root 6 Jul 10 2019 bzegrep -> bzgrep - -rwxr-xr-x 1 root root 4877 Jun 24 2019 bzexe - lrwxrwxrwx 1 root root 6 Jul 10 2019 bzfgrep -> bzgrep - -rwxr-xr-x 1 root root 3641 Jul 10 2019 bzgrep - -rwxr-xr-x 3 root root 38984 Jul 10 2019 bzip2 - -rwxr-xr-x 1 root root 14328 Jul 10 2019 bzip2recover - lrwxrwxrwx 1 root root 6 Jul 10 2019 bzless -> bzmore - -rwxr-xr-x 1 root root 1297 Jul 10 2019 bzmore - -rwxr-xr-x 1 root root 43744 Feb 28 2019 cat - -rwxr-xr-x 1 root root 64320 Feb 28 2019 chgrp - -rwxr-xr-x 1 root root 64288 Feb 28 2019 chmod - -rwxr-xr-x 1 root root 72512 Feb 28 2019 chown - -rwxr-xr-x 1 root root 146880 Feb 28 2019 cp - -rwxr-xr-x 1 root root 121464 Jan 17 2019 dash - -rwxr-xr-x 1 root root 109408 Feb 28 2019 date - -rwxr-xr-x 1 root root 76712 Feb 28 2019 dd - -rwxr-xr-x 1 root root 93744 Feb 28 2019 df - -rwxr-xr-x 1 root root 138856 Feb 28 2019 dir - -rwxr-xr-x 1 root root 84288 Jan 9 2019 dmesg - lrwxrwxrwx 1 root root 8 Sep 26 2018 dnsdomainname -> hostname - lrwxrwxrwx 1 root root 8 Sep 26 2018 domainname -> hostname - -rwxr-xr-x 1 root root 39520 Feb 28 2019 echo - -rwxr-xr-x 1 root root 28 Jan 7 2019 egrep - -rwxr-xr-x 1 root root 35424 Feb 28 2019 false - -rwxr-xr-x 1 root root 28 Jan 7 2019 fgrep - -rwxr-xr-x 1 root root 68880 Jan 9 2019 findmnt - -rwsr-xr-x 1 root root 34896 Apr 22 2020 fusermount - -rwxr-xr-x 1 root root 198976 Jan 7 2019 grep - -rwxr-xr-x 2 root root 2345 Jan 5 2019 gunzip - -rwxr-xr-x 1 root root 6375 Jan 5 2019 gzexe - -rwxr-xr-x 1 root root 98048 Jan 5 2019 gzip - -rwxr-xr-x 1 root root 26696 Sep 26 2018 hostname - -rwxr-xr-x 1 root root 68552 Feb 28 2019 ln - -rwxr-xr-x 1 root root 56760 Jul 26 2018 login - -rwxr-xr-x 1 root root 138856 Feb 28 2019 ls - -rwxr-xr-x 1 root root 108624 Jan 9 2019 lsblk - -rwxr-xr-x 1 root root 89088 Feb 28 2019 mkdir - -rwxr-xr-x 1 root root 68544 Feb 28 2019 mknod - -rwxr-xr-x 1 root root 43808 Feb 28 2019 mktemp - -rwxr-xr-x 1 root root 43008 Jan 9 2019 more - -rwsr-xr-x 1 root root 51280 Jan 9 2019 mount - -rwxr-xr-x 1 root root 14408 Jan 9 2019 mountpoint - -rwxr-xr-x 1 root root 138728 Feb 28 2019 mv - lrwxrwxrwx 1 root root 8 Sep 26 2018 nisdomainname -> hostname - lrwxrwxrwx 1 root root 14 Feb 14 2019 pidof -> /sbin/killall5 - -rwxr-xr-x 1 root root 39616 Feb 28 2019 pwd - lrwxrwxrwx 1 root root 4 Apr 17 2019 rbash -> bash - -rwxr-xr-x 1 root root 47776 Feb 28 2019 readlink - -rwxr-xr-x 1 root root 68416 Feb 28 2019 rm - -rwxr-xr-x 1 root root 47776 Feb 28 2019 rmdir - -rwxr-xr-x 1 root root 23312 Jan 21 2019 run-parts - -rwxr-xr-x 1 root root 122224 Dec 22 2018 sed - lrwxrwxrwx 1 root root 4 Nov 7 09:58 sh -> dash - -rwxr-xr-x 1 root root 39552 Feb 28 2019 sleep - -rwxr-xr-x 1 root root 80672 Feb 28 2019 stty - -rwsr-xr-x 1 root root 63568 Jan 9 2019 su - -rwxr-xr-x 1 root root 35488 Feb 28 2019 sync - -rwxr-xr-x 1 root root 445560 Apr 23 2019 tar - -rwxr-xr-x 1 root root 14440 Jan 21 2019 tempfile - -rwxr-xr-x 1 root root 97152 Feb 28 2019 touch - -rwxr-xr-x 1 root root 35424 Feb 28 2019 true - -rwxr-xr-x 1 root root 14328 Apr 22 2020 ulockmgr_server - -rwsr-xr-x 1 root root 34888 Jan 9 2019 umount - -rwxr-xr-x 1 root root 39584 Feb 28 2019 uname - -rwxr-xr-x 2 root root 2345 Jan 5 2019 uncompress - -rwxr-xr-x 1 root root 138856 Feb 28 2019 vdir - -rwxr-xr-x 1 root root 34896 Jan 9 2019 wdctl - -rwxr-xr-x 1 root root 946 Jan 21 2019 which - lrwxrwxrwx 1 root root 8 Sep 26 2018 ypdomainname -> hostname - -rwxr-xr-x 1 root root 1983 Jan 5 2019 zcat - -rwxr-xr-x 1 root root 1677 Jan 5 2019 zcmp - -rwxr-xr-x 1 root root 5879 Jan 5 2019 zdiff - -rwxr-xr-x 1 root root 29 Jan 5 2019 zegrep - -rwxr-xr-x 1 root root 29 Jan 5 2019 zfgrep - -rwxr-xr-x 1 root root 2080 Jan 5 2019 zforce - -rwxr-xr-x 1 root root 7584 Jan 5 2019 zgrep - -rwxr-xr-x 1 root root 2205 Jan 5 2019 zless - -rwxr-xr-x 1 root root 1841 Jan 5 2019 zmore - -rwxr-xr-x 1 root root 4552 Jan 5 2019 znew -I: user script /srv/workspace/pbuilder/2033725/tmp/hooks/D02_print_environment finished + -rwxr-xr-x 1 root root 1168776 Apr 18 2019 bash + -rwxr-xr-x 3 root root 38984 Jul 11 2019 bunzip2 + -rwxr-xr-x 3 root root 38984 Jul 11 2019 bzcat + lrwxrwxrwx 1 root root 6 Jul 11 2019 bzcmp -> bzdiff + -rwxr-xr-x 1 root root 2227 Jul 11 2019 bzdiff + lrwxrwxrwx 1 root root 6 Jul 11 2019 bzegrep -> bzgrep + -rwxr-xr-x 1 root root 4877 Jun 25 2019 bzexe + lrwxrwxrwx 1 root root 6 Jul 11 2019 bzfgrep -> bzgrep + -rwxr-xr-x 1 root root 3641 Jul 11 2019 bzgrep + -rwxr-xr-x 3 root root 38984 Jul 11 2019 bzip2 + -rwxr-xr-x 1 root root 14328 Jul 11 2019 bzip2recover + lrwxrwxrwx 1 root root 6 Jul 11 2019 bzless -> bzmore + -rwxr-xr-x 1 root root 1297 Jul 11 2019 bzmore + -rwxr-xr-x 1 root root 43744 Mar 1 2019 cat + -rwxr-xr-x 1 root root 64320 Mar 1 2019 chgrp + -rwxr-xr-x 1 root root 64288 Mar 1 2019 chmod + -rwxr-xr-x 1 root root 72512 Mar 1 2019 chown + -rwxr-xr-x 1 root root 146880 Mar 1 2019 cp + -rwxr-xr-x 1 root root 121464 Jan 18 2019 dash + -rwxr-xr-x 1 root root 109408 Mar 1 2019 date + -rwxr-xr-x 1 root root 76712 Mar 1 2019 dd + -rwxr-xr-x 1 root root 93744 Mar 1 2019 df + -rwxr-xr-x 1 root root 138856 Mar 1 2019 dir + -rwxr-xr-x 1 root root 84288 Jan 10 2019 dmesg + lrwxrwxrwx 1 root root 8 Sep 27 2018 dnsdomainname -> hostname + lrwxrwxrwx 1 root root 8 Sep 27 2018 domainname -> hostname + -rwxr-xr-x 1 root root 39520 Mar 1 2019 echo + -rwxr-xr-x 1 root root 28 Jan 8 2019 egrep + -rwxr-xr-x 1 root root 35424 Mar 1 2019 false + -rwxr-xr-x 1 root root 28 Jan 8 2019 fgrep + -rwxr-xr-x 1 root root 68880 Jan 10 2019 findmnt + -rwsr-xr-x 1 root root 34896 Apr 23 2020 fusermount + -rwxr-xr-x 1 root root 198976 Jan 8 2019 grep + -rwxr-xr-x 2 root root 2345 Jan 6 2019 gunzip + -rwxr-xr-x 1 root root 6375 Jan 6 2019 gzexe + -rwxr-xr-x 1 root root 98048 Jan 6 2019 gzip + -rwxr-xr-x 1 root root 26696 Sep 27 2018 hostname + -rwxr-xr-x 1 root root 68552 Mar 1 2019 ln + -rwxr-xr-x 1 root root 56760 Jul 27 2018 login + -rwxr-xr-x 1 root root 138856 Mar 1 2019 ls + -rwxr-xr-x 1 root root 108624 Jan 10 2019 lsblk + -rwxr-xr-x 1 root root 89088 Mar 1 2019 mkdir + -rwxr-xr-x 1 root root 68544 Mar 1 2019 mknod + -rwxr-xr-x 1 root root 43808 Mar 1 2019 mktemp + -rwxr-xr-x 1 root root 43008 Jan 10 2019 more + -rwsr-xr-x 1 root root 51280 Jan 10 2019 mount + -rwxr-xr-x 1 root root 14408 Jan 10 2019 mountpoint + -rwxr-xr-x 1 root root 138728 Mar 1 2019 mv + lrwxrwxrwx 1 root root 8 Sep 27 2018 nisdomainname -> hostname + lrwxrwxrwx 1 root root 14 Feb 15 2019 pidof -> /sbin/killall5 + -rwxr-xr-x 1 root root 39616 Mar 1 2019 pwd + lrwxrwxrwx 1 root root 4 Apr 18 2019 rbash -> bash + -rwxr-xr-x 1 root root 47776 Mar 1 2019 readlink + -rwxr-xr-x 1 root root 68416 Mar 1 2019 rm + -rwxr-xr-x 1 root root 47776 Mar 1 2019 rmdir + -rwxr-xr-x 1 root root 23312 Jan 22 2019 run-parts + -rwxr-xr-x 1 root root 122224 Dec 23 2018 sed + lrwxrwxrwx 1 root root 4 Jan 3 09:21 sh -> bash + lrwxrwxrwx 1 root root 4 Dec 11 18:20 sh.distrib -> dash + -rwxr-xr-x 1 root root 39552 Mar 1 2019 sleep + -rwxr-xr-x 1 root root 80672 Mar 1 2019 stty + -rwsr-xr-x 1 root root 63568 Jan 10 2019 su + -rwxr-xr-x 1 root root 35488 Mar 1 2019 sync + -rwxr-xr-x 1 root root 445560 Apr 24 2019 tar + -rwxr-xr-x 1 root root 14440 Jan 22 2019 tempfile + -rwxr-xr-x 1 root root 97152 Mar 1 2019 touch + -rwxr-xr-x 1 root root 35424 Mar 1 2019 true + -rwxr-xr-x 1 root root 14328 Apr 23 2020 ulockmgr_server + -rwsr-xr-x 1 root root 34888 Jan 10 2019 umount + -rwxr-xr-x 1 root root 39584 Mar 1 2019 uname + -rwxr-xr-x 2 root root 2345 Jan 6 2019 uncompress + -rwxr-xr-x 1 root root 138856 Mar 1 2019 vdir + -rwxr-xr-x 1 root root 34896 Jan 10 2019 wdctl + -rwxr-xr-x 1 root root 946 Jan 22 2019 which + lrwxrwxrwx 1 root root 8 Sep 27 2018 ypdomainname -> hostname + -rwxr-xr-x 1 root root 1983 Jan 6 2019 zcat + -rwxr-xr-x 1 root root 1677 Jan 6 2019 zcmp + -rwxr-xr-x 1 root root 5879 Jan 6 2019 zdiff + -rwxr-xr-x 1 root root 29 Jan 6 2019 zegrep + -rwxr-xr-x 1 root root 29 Jan 6 2019 zfgrep + -rwxr-xr-x 1 root root 2080 Jan 6 2019 zforce + -rwxr-xr-x 1 root root 7584 Jan 6 2019 zgrep + -rwxr-xr-x 1 root root 2205 Jan 6 2019 zless + -rwxr-xr-x 1 root root 1841 Jan 6 2019 zmore + -rwxr-xr-x 1 root root 4552 Jan 6 2019 znew +I: user script /srv/workspace/pbuilder/3854983/tmp/hooks/D02_print_environment finished -> Attempting to satisfy build-dependencies -> Creating pbuilder-satisfydepends-dummy package Package: pbuilder-satisfydepends-dummy @@ -354,7 +388,7 @@ Get: 119 http://deb.debian.org/debian buster/main amd64 python3-setuptools-scm all 3.2.0-1 [24.1 kB] Get: 120 http://deb.debian.org/debian buster/main amd64 sphinx-common all 1.8.4-1 [500 kB] Get: 121 http://deb.debian.org/debian buster/main amd64 python3-sphinx all 1.8.4-1 [481 kB] -Fetched 41.4 MB in 1s (36.8 MB/s) +Fetched 41.4 MB in 1s (69.6 MB/s) debconf: delaying package configuration, since apt-utils is not installed Selecting previously unselected package libbsd0:amd64. (Reading database ... (Reading database ... 5% (Reading database ... 10% (Reading database ... 15% (Reading database ... 20% (Reading database ... 25% (Reading database ... 30% (Reading database ... 35% (Reading database ... 40% (Reading database ... 45% (Reading database ... 50% (Reading database ... 55% (Reading database ... 60% (Reading database ... 65% (Reading database ... 70% (Reading database ... 75% (Reading database ... 80% (Reading database ... 85% (Reading database ... 90% (Reading database ... 95% (Reading database ... 100% (Reading database ... 19195 files and directories currently installed.) @@ -894,7 +928,8 @@ fakeroot is already the newest version (1.23-1). 0 upgraded, 0 newly installed, 0 to remove and 0 not upgraded. I: Building the package -I: Running cd /build/cherrypy3-8.9.1/ && env PATH="/usr/sbin:/usr/bin:/sbin:/bin:/usr/games" HOME="/nonexistent/first-build" dpkg-buildpackage -us -uc -b && env PATH="/usr/sbin:/usr/bin:/sbin:/bin:/usr/games" HOME="/nonexistent/first-build" dpkg-genchanges -S > ../cherrypy3_8.9.1-2_source.changes +hostname: Name or service not known +I: Running cd /build/cherrypy3-8.9.1/ && env PATH="/usr/sbin:/usr/bin:/sbin:/bin:/usr/games:/i/capture/the/path" HOME="/nonexistent/second-build" dpkg-buildpackage -us -uc -b && env PATH="/usr/sbin:/usr/bin:/sbin:/bin:/usr/games:/i/capture/the/path" HOME="/nonexistent/second-build" dpkg-genchanges -S > ../cherrypy3_8.9.1-2_source.changes dpkg-buildpackage: info: source package cherrypy3 dpkg-buildpackage: info: source version 8.9.1-2 dpkg-buildpackage: info: source distribution unstable @@ -1252,9 +1287,9 @@ cherrypy/test/test_static.py:36: IOError ------------------------------ Captured log setup ------------------------------ -_cplogging.py 219 INFO [30/Nov/2021:00:57:09] ENGINE Listening for SIGHUP. -_cplogging.py 219 INFO [30/Nov/2021:00:57:09] ENGINE Listening for SIGTERM. -_cplogging.py 219 INFO [30/Nov/2021:00:57:09] ENGINE Listening for SIGUSR1. +_cplogging.py 219 INFO [03/Jan/2023:09:23:41] ENGINE Listening for SIGHUP. +_cplogging.py 219 INFO [03/Jan/2023:09:23:41] ENGINE Listening for SIGTERM. +_cplogging.py 219 INFO [03/Jan/2023:09:23:41] ENGINE Listening for SIGUSR1. _______________ ERROR at setup of StaticTest.test_config_errors ________________ @staticmethod @@ -1406,7 +1441,7 @@ baseconf = {'environment': 'test_suite', 'host': '127.0.0.1', 'port': 54583, 'protocol': 'HTTP/1.1', ...} cls = conf = {'host': '127.0.0.1', 'port': 54583, 'protocol': 'HTTP/1.1', 'scheme': 'http', ...} -supervisor = +supervisor = supervisor_factory = cherrypy/test/helper.py:290: @@ -1452,13 +1487,13 @@ fd = sys.stdin.fileno() _ _ _ _ _ _ _ _ _ _ _ _ _ _ _ _ _ _ _ _ _ _ _ _ _ _ _ _ _ _ _ _ _ _ _ _ _ _ _ _ -self = <_pytest.capture.DontReadFromInput object at 0x7f64ea1de290> +self = <_pytest.capture.DontReadFromInput object at 0x7f6cddba6290> def fileno(self): > raise UnsupportedOperation("redirected stdin is pseudofile, has no fileno()") E UnsupportedOperation: redirected stdin is pseudofile, has no fileno() -self = <_pytest.capture.DontReadFromInput object at 0x7f64ea1de290> +self = <_pytest.capture.DontReadFromInput object at 0x7f6cddba6290> /usr/lib/python2.7/dist-packages/_pytest/capture.py:663: UnsupportedOperation ----------------------------- Captured stdout call ----------------------------- @@ -1466,8 +1501,8 @@ ERROR: Status ('404 Not Found') != '200 OK' Show: [B]ody [H]eaders [S]tatus [U]RL; [I]gnore, [R]aise, or sys.e[X]it >> ------------------------------ Captured log call ------------------------------- -_cplogging.py 302 INFO 127.0.0.1 - - [30/Nov/2021:00:55:51] "GET /expires/specific HTTP/1.1" 200 19 "" "" -_cplogging.py 219 ERROR [30/Nov/2021:00:55:51] +_cplogging.py 302 INFO 127.0.0.1 - - [03/Jan/2023:09:22:30] "GET /expires/specific HTTP/1.1" 200 19 "" "" +_cplogging.py 219 ERROR [03/Jan/2023:09:22:30] Traceback (most recent call last): File "/build/cherrypy3-8.9.1/.pybuild/cpython2_2.7_cherrypy3/build/cherrypy/_cprequest.py", line 104, in run hook() @@ -1476,15 +1511,15 @@ File "/build/cherrypy3-8.9.1/.pybuild/cpython2_2.7_cherrypy3/build/cherrypy/lib/caching.py", line 468, in expires expiry = httputil.HTTPDate(response.time + secs) TypeError: unsupported operand type(s) for +: 'float' and 'Foo' -_cplogging.py 219 ERROR [30/Nov/2021:00:55:51] HTTP +_cplogging.py 219 ERROR [03/Jan/2023:09:22:30] HTTP Traceback (most recent call last): File "/build/cherrypy3-8.9.1/.pybuild/cpython2_2.7_cherrypy3/build/cherrypy/_cprequest.py", line 674, in respond self.hooks.run('before_finalize') File "/build/cherrypy3-8.9.1/.pybuild/cpython2_2.7_cherrypy3/build/cherrypy/_cprequest.py", line 114, in run raise exc TypeError: unsupported operand type(s) for +: 'float' and 'Foo' -_cplogging.py 302 INFO 127.0.0.1 - - [30/Nov/2021:00:55:51] "GET /expires/wrongtype HTTP/1.1" 500 1202 "" "" -_cplogging.py 302 INFO 127.0.0.1 - - [30/Nov/2021:00:55:51] "GET /expires/index.html HTTP/1.1" 404 1298 "" "" +_cplogging.py 302 INFO 127.0.0.1 - - [03/Jan/2023:09:22:30] "GET /expires/wrongtype HTTP/1.1" 500 1202 "" "" +_cplogging.py 302 INFO 127.0.0.1 - - [03/Jan/2023:09:22:30] "GET /expires/index.html HTTP/1.1" 404 1298 "" "" __________________ ConfigTests.testHandlerToolConfigOverride ___________________ self = @@ -1502,7 +1537,7 @@ cherrypy/test/test_config.py:237: IOError ------------------------------ Captured log call ------------------------------- -_cplogging.py 302 INFO 127.0.0.1 - - [30/Nov/2021:00:55:53] "GET /favicon.ico HTTP/1.1" 404 1470 "" "" +_cplogging.py 302 INFO 127.0.0.1 - - [03/Jan/2023:09:22:32] "GET /favicon.ico HTTP/1.1" 404 1470 "" "" ___________________________ ConnectionTests.test_598 ___________________________ self = @@ -1531,7 +1566,7 @@ self.timeout, self.source_address) _ _ _ _ _ _ _ _ _ _ _ _ _ _ _ _ _ _ _ _ _ _ _ _ _ _ _ _ _ _ _ _ _ _ _ _ _ _ _ _ -address = ('127.0.0.1', 9), timeout = +address = ('127.0.0.1', 9), timeout = source_address = None def create_connection(address, timeout=_GLOBAL_DEFAULT_TIMEOUT, @@ -1581,20 +1616,20 @@ proto = 6 res = (2, 1, 6, '', ('127.0.0.1', 9)) sa = ('127.0.0.1', 9) -sock = +sock = socktype = 1 source_address = None -timeout = +timeout = /usr/lib/python2.7/socket.py:575: IOError ------------------------------ Captured log setup ------------------------------ -_cplogging.py 219 INFO [30/Nov/2021:00:56:03] ENGINE Listening for SIGHUP. -_cplogging.py 219 INFO [30/Nov/2021:00:56:03] ENGINE Listening for SIGTERM. -_cplogging.py 219 INFO [30/Nov/2021:00:56:03] ENGINE Listening for SIGUSR1. -_cplogging.py 219 INFO [30/Nov/2021:00:56:03] ENGINE Bus STARTING -_cplogging.py 219 INFO [30/Nov/2021:00:56:03] ENGINE Started monitor thread '_TimeoutMonitor'. -_cplogging.py 219 INFO [30/Nov/2021:00:56:04] ENGINE Serving on http://127.0.0.1:54583 -_cplogging.py 219 INFO [30/Nov/2021:00:56:04] ENGINE Bus STARTED +_cplogging.py 219 INFO [03/Jan/2023:09:22:41] ENGINE Listening for SIGHUP. +_cplogging.py 219 INFO [03/Jan/2023:09:22:41] ENGINE Listening for SIGTERM. +_cplogging.py 219 INFO [03/Jan/2023:09:22:41] ENGINE Listening for SIGUSR1. +_cplogging.py 219 INFO [03/Jan/2023:09:22:41] ENGINE Bus STARTING +_cplogging.py 219 INFO [03/Jan/2023:09:22:41] ENGINE Started monitor thread '_TimeoutMonitor'. +_cplogging.py 219 INFO [03/Jan/2023:09:22:41] ENGINE Serving on http://127.0.0.1:54583 +_cplogging.py 219 INFO [03/Jan/2023:09:22:41] ENGINE Bus STARTED _____________________ CoreRequestHandlingTest.testFavicon ______________________ self = @@ -1644,13 +1679,13 @@ fd = sys.stdin.fileno() _ _ _ _ _ _ _ _ _ _ _ _ _ _ _ _ _ _ _ _ _ _ _ _ _ _ _ _ _ _ _ _ _ _ _ _ _ _ _ _ -self = <_pytest.capture.DontReadFromInput object at 0x7f64ea1de290> +self = <_pytest.capture.DontReadFromInput object at 0x7f6cddba6290> def fileno(self): > raise UnsupportedOperation("redirected stdin is pseudofile, has no fileno()") E UnsupportedOperation: redirected stdin is pseudofile, has no fileno() -self = <_pytest.capture.DontReadFromInput object at 0x7f64ea1de290> +self = <_pytest.capture.DontReadFromInput object at 0x7f6cddba6290> /usr/lib/python2.7/dist-packages/_pytest/capture.py:663: UnsupportedOperation ----------------------------- Captured stdout call ----------------------------- @@ -1658,10 +1693,10 @@ ERROR: Status ('404 Not Found') != 206 Show: [B]ody [H]eaders [S]tatus [U]RL; [I]gnore, [R]aise, or sys.e[X]it >> ------------------------------ Captured log call ------------------------------- -_cplogging.py 302 INFO 127.0.0.1 - - [30/Nov/2021:00:56:06] "GET /ranges/get_ranges?bytes=3-6 HTTP/1.1" 200 8 "" "" -_cplogging.py 302 INFO 127.0.0.1 - - [30/Nov/2021:00:56:06] "GET /ranges/get_ranges?bytes=2-4,-1 HTTP/1.1" 200 16 "" "" -_cplogging.py 302 INFO 127.0.0.1 - - [30/Nov/2021:00:56:06] "GET /ranges/get_ranges?bytes=-100 HTTP/1.1" 200 8 "" "" -_cplogging.py 302 INFO 127.0.0.1 - - [30/Nov/2021:00:56:06] "GET /ranges/slice_file HTTP/1.1" 404 1649 "" "" +_cplogging.py 302 INFO 127.0.0.1 - - [03/Jan/2023:09:22:42] "GET /ranges/get_ranges?bytes=3-6 HTTP/1.1" 200 8 "" "" +_cplogging.py 302 INFO 127.0.0.1 - - [03/Jan/2023:09:22:42] "GET /ranges/get_ranges?bytes=2-4,-1 HTTP/1.1" 200 16 "" "" +_cplogging.py 302 INFO 127.0.0.1 - - [03/Jan/2023:09:22:42] "GET /ranges/get_ranges?bytes=-100 HTTP/1.1" 200 8 "" "" +_cplogging.py 302 INFO 127.0.0.1 - - [03/Jan/2023:09:22:42] "GET /ranges/slice_file HTTP/1.1" 404 1649 "" "" ___________________ EncodingTests.test_query_string_decoding ___________________ self = @@ -1686,7 +1721,7 @@ skip_accept_encoding=True) _ _ _ _ _ _ _ _ _ _ _ _ _ _ _ _ _ _ _ _ _ _ _ _ _ _ _ _ _ _ _ _ _ _ _ _ _ _ _ _ -self = , method = 'GET' +self = , method = 'GET' url = '/?param=\xc2\xa3', skip_host = True, skip_accept_encoding = True def putrequest(self, method, url, skip_host=0, skip_accept_encoding=0): @@ -1739,9 +1774,9 @@ > % (url, match.group())) E InvalidURL: URL can't contain control characters. '/?param=\xc2\xa3' (found at least '\xc2') -match = <_sre.SRE_Match object at 0x7f64e86b5f38> +match = <_sre.SRE_Match object at 0x7f6cd47e6bf8> method = 'GET' -self = +self = skip_accept_encoding = True skip_host = True url = '/?param=\xc2\xa3' @@ -1810,13 +1845,13 @@ fd = sys.stdin.fileno() _ _ _ _ _ _ _ _ _ _ _ _ _ _ _ _ _ _ _ _ _ _ _ _ _ _ _ _ _ _ _ _ _ _ _ _ _ _ _ _ -self = <_pytest.capture.DontReadFromInput object at 0x7f64ea1de290> +self = <_pytest.capture.DontReadFromInput object at 0x7f6cddba6290> def fileno(self): > raise UnsupportedOperation("redirected stdin is pseudofile, has no fileno()") E UnsupportedOperation: redirected stdin is pseudofile, has no fileno() -self = <_pytest.capture.DontReadFromInput object at 0x7f64ea1de290> +self = <_pytest.capture.DontReadFromInput object at 0x7f6cddba6290> /usr/lib/python2.7/dist-packages/_pytest/capture.py:663: UnsupportedOperation ----------------------------- Captured stdout call ----------------------------- @@ -1828,8 +1863,8 @@ '\n\n\n \n 404 Not Found\n \n\n \n

404 Not Found

\n

No, <b>really</b>, not found!
In addition, the custom error page failed:\n
IOError: [Errno 2] No such file or directory: \'/build/cherrypy3-8.9.1/.pybuild/cpython2_2.7_cherrypy3/build/cherrypy/test/static/index.html\'\n

\n
Traceback (most recent call last):\n  File "/build/cherrypy3-8.9.1/.pybuild/cpython2_2.7_cherrypy3/build/cherrypy/_cprequest.py", line 670, in respond\n    response.body = self.handler()\n  File "/build/cherrypy3-8.9.1/.pybuild/cpython2_2.7_cherrypy3/build/cherrypy/lib/encoding.py", line 220, in __call__\n    self.body = self.oldhandler(*args, **kwargs)\n  File "/build/cherrypy3-8.9.1/.pybuild/cpython2_2.7_cherrypy3/build/cherrypy/_cpdispatch.py", line 60, in __call__\n    return self.callable(*self.args, **self.kwargs)\n  File "/build/cherrypy3-8.9.1/.pybuild/cpython2_2.7_cherrypy3/build/cherrypy/test/test_request_obj.py", line 147, in custom\n    int(err), \'No, <b>really</b>, not found!\')\nHTTPError: (404, \'No, <b>really</b>, not found!\')\n
\n
\n \n Powered by CherryPy unknown\n \n
\n \n\n' Show: [B]ody [H]eaders [S]tatus [U]RL; [I]gnore, [R]aise, or sys.e[X]it >> ------------------------------ Captured log call ------------------------------- -_cplogging.py 302 INFO 127.0.0.1 - - [30/Nov/2021:00:56:25] "GET /error/missing HTTP/1.1" 404 1288 "" "" -_cplogging.py 219 ERROR [30/Nov/2021:00:56:25] HTTP +_cplogging.py 302 INFO 127.0.0.1 - - [03/Jan/2023:09:22:59] "GET /error/missing HTTP/1.1" 404 1288 "" "" +_cplogging.py 219 ERROR [03/Jan/2023:09:22:59] HTTP Traceback (most recent call last): File "/build/cherrypy3-8.9.1/.pybuild/cpython2_2.7_cherrypy3/build/cherrypy/_cprequest.py", line 670, in respond response.body = self.handler() @@ -1840,8 +1875,8 @@ File "/build/cherrypy3-8.9.1/.pybuild/cpython2_2.7_cherrypy3/build/cherrypy/test/test_request_obj.py", line 160, in page_method raise ValueError() ValueError -_cplogging.py 302 INFO 127.0.0.1 - - [30/Nov/2021:00:56:25] "GET /error/page_method HTTP/1.1" 500 1509 "" "" -_cplogging.py 219 ERROR [30/Nov/2021:00:56:25] HTTP +_cplogging.py 302 INFO 127.0.0.1 - - [03/Jan/2023:09:22:59] "GET /error/page_method HTTP/1.1" 500 1509 "" "" +_cplogging.py 219 ERROR [03/Jan/2023:09:22:59] HTTP Traceback (most recent call last): File "/build/cherrypy3-8.9.1/.pybuild/cpython2_2.7_cherrypy3/build/cherrypy/_cprequest.py", line 670, in respond response.body = self.handler() @@ -1854,9 +1889,9 @@ File "/build/cherrypy3-8.9.1/.pybuild/cpython2_2.7_cherrypy3/build/cherrypy/test/test_request_obj.py", line 164, in page_yield raise ValueError() ValueError -_cplogging.py 302 INFO 127.0.0.1 - - [30/Nov/2021:00:56:25] "GET /error/page_yield HTTP/1.1" 500 1672 "" "" -_cplogging.py 302 INFO 127.0.0.1 - - [30/Nov/2021:00:56:25] "GET /error/page_streamed HTTP/1.1" 200 - "" "" -_cplogging.py 219 ERROR [30/Nov/2021:00:56:25] Traceback (most recent call last): +_cplogging.py 302 INFO 127.0.0.1 - - [03/Jan/2023:09:22:59] "GET /error/page_yield HTTP/1.1" 500 1672 "" "" +_cplogging.py 302 INFO 127.0.0.1 - - [03/Jan/2023:09:22:59] "GET /error/page_streamed HTTP/1.1" 200 - "" "" +_cplogging.py 219 ERROR [03/Jan/2023:09:22:59] Traceback (most recent call last): File "/build/cherrypy3-8.9.1/.pybuild/cpython2_2.7_cherrypy3/build/cherrypy/_cpwsgi.py", line 189, in trap return func(*args, **kwargs) File "/build/cherrypy3-8.9.1/.pybuild/cpython2_2.7_cherrypy3/build/cherrypy/_cpwsgi.py", line 285, in __next__ @@ -1867,7 +1902,7 @@ raise ValueError() ValueError -_cplogging.py 219 ERROR [30/Nov/2021:00:56:25] +_cplogging.py 219 ERROR [03/Jan/2023:09:22:59] Traceback (most recent call last): File "/build/cherrypy3-8.9.1/.pybuild/cpython2_2.7_cherrypy3/build/cherrypy/_cpwsgi.py", line 214, in trap self.start_response(s, h, _sys.exc_info()) @@ -1882,7 +1917,7 @@ File "/build/cherrypy3-8.9.1/.pybuild/cpython2_2.7_cherrypy3/build/cherrypy/test/test_request_obj.py", line 169, in page_streamed raise ValueError() ValueError -_cplogging.py 219 ERROR [30/Nov/2021:00:56:25] ENGINE ValueError() +_cplogging.py 219 ERROR [03/Jan/2023:09:22:59] ENGINE ValueError() Traceback (most recent call last): File "/build/cherrypy3-8.9.1/.pybuild/cpython2_2.7_cherrypy3/build/cherrypy/wsgiserver/__init__.py", line 1408, in communicate req.respond() @@ -1906,9 +1941,9 @@ raise ValueError() ValueError -_cplogging.py 302 INFO 127.0.0.1 - - [30/Nov/2021:00:56:25] "GET /error/cause_err_in_finalize HTTP/1.1" 500 790 "" "" -_cplogging.py 302 INFO 127.0.0.1 - - [30/Nov/2021:00:56:25] "GET /error/reason_phrase HTTP/1.1" 410 1506 "" "" -_cplogging.py 302 INFO 127.0.0.1 - - [30/Nov/2021:00:56:25] "GET /error/custom HTTP/1.1" 404 1710 "" "" +_cplogging.py 302 INFO 127.0.0.1 - - [03/Jan/2023:09:22:59] "GET /error/cause_err_in_finalize HTTP/1.1" 500 790 "" "" +_cplogging.py 302 INFO 127.0.0.1 - - [03/Jan/2023:09:22:59] "GET /error/reason_phrase HTTP/1.1" 410 1506 "" "" +_cplogging.py 302 INFO 127.0.0.1 - - [03/Jan/2023:09:22:59] "GET /error/custom HTTP/1.1" 404 1710 "" "" ________________________ TutorialTest.test01HelloWorld _________________________ self = @@ -1934,7 +1969,7 @@ self.read(file) _ _ _ _ _ _ _ _ _ _ _ _ _ _ _ _ _ _ _ _ _ _ _ _ _ _ _ _ _ _ _ _ _ _ _ _ _ _ _ _ -self = +self = filenames = ['/build/cherrypy3-8.9.1/.pybuild/cpython2_2.7_cherrypy3/build/cherrypy/tutorial/tutorial.conf'] def read(self, filenames): @@ -1950,19 +1985,19 @@ filename = '/build/cherrypy3-8.9.1/.pybuild/cpython2_2.7_cherrypy3/build/cherrypy/tutorial/tutorial.conf' filenames = ['/build/cherrypy3-8.9.1/.pybuild/cpython2_2.7_cherrypy3/build/cherrypy/tutorial/tutorial.conf'] -self = +self = cherrypy/lib/reprconf.py:197: IOError ------------------------------ Captured log setup ------------------------------ -_cplogging.py 219 INFO [30/Nov/2021:00:57:11] ENGINE Listening for SIGHUP. -_cplogging.py 219 INFO [30/Nov/2021:00:57:11] ENGINE Listening for SIGTERM. -_cplogging.py 219 INFO [30/Nov/2021:00:57:11] ENGINE Listening for SIGUSR1. -_cplogging.py 219 INFO [30/Nov/2021:00:57:11] ENGINE Bus STARTING -_cplogging.py 219 INFO [30/Nov/2021:00:57:11] ENGINE Started monitor thread 'Session cleanup'. -_cplogging.py 219 INFO [30/Nov/2021:00:57:11] ENGINE Started monitor thread '_TimeoutMonitor'. -_cplogging.py 219 INFO [30/Nov/2021:00:57:11] ENGINE Started monitor thread 'Session cleanup'. -_cplogging.py 219 INFO [30/Nov/2021:00:57:11] ENGINE Serving on http://127.0.0.1:54583 -_cplogging.py 219 INFO [30/Nov/2021:00:57:11] ENGINE Bus STARTED +_cplogging.py 219 INFO [03/Jan/2023:09:23:42] ENGINE Listening for SIGHUP. +_cplogging.py 219 INFO [03/Jan/2023:09:23:42] ENGINE Listening for SIGTERM. +_cplogging.py 219 INFO [03/Jan/2023:09:23:42] ENGINE Listening for SIGUSR1. +_cplogging.py 219 INFO [03/Jan/2023:09:23:42] ENGINE Bus STARTING +_cplogging.py 219 INFO [03/Jan/2023:09:23:42] ENGINE Started monitor thread '_TimeoutMonitor'. +_cplogging.py 219 INFO [03/Jan/2023:09:23:42] ENGINE Started monitor thread 'Session cleanup'. +_cplogging.py 219 INFO [03/Jan/2023:09:23:42] ENGINE Started monitor thread 'Session cleanup'. +_cplogging.py 219 INFO [03/Jan/2023:09:23:42] ENGINE Serving on http://127.0.0.1:54583 +_cplogging.py 219 INFO [03/Jan/2023:09:23:42] ENGINE Bus STARTED _______________________ TutorialTest.test02ExposeMethods _______________________ self = @@ -1988,7 +2023,7 @@ self.read(file) _ _ _ _ _ _ _ _ _ _ _ _ _ _ _ _ _ _ _ _ _ _ _ _ _ _ _ _ _ _ _ _ _ _ _ _ _ _ _ _ -self = +self = filenames = ['/build/cherrypy3-8.9.1/.pybuild/cpython2_2.7_cherrypy3/build/cherrypy/tutorial/tutorial.conf'] def read(self, filenames): @@ -2004,7 +2039,7 @@ filename = '/build/cherrypy3-8.9.1/.pybuild/cpython2_2.7_cherrypy3/build/cherrypy/tutorial/tutorial.conf' filenames = ['/build/cherrypy3-8.9.1/.pybuild/cpython2_2.7_cherrypy3/build/cherrypy/tutorial/tutorial.conf'] -self = +self = cherrypy/lib/reprconf.py:197: IOError ________________________ TutorialTest.test03GetAndPost _________________________ @@ -2032,7 +2067,7 @@ self.read(file) _ _ _ _ _ _ _ _ _ _ _ _ _ _ _ _ _ _ _ _ _ _ _ _ _ _ _ _ _ _ _ _ _ _ _ _ _ _ _ _ -self = +self = filenames = ['/build/cherrypy3-8.9.1/.pybuild/cpython2_2.7_cherrypy3/build/cherrypy/tutorial/tutorial.conf'] def read(self, filenames): @@ -2048,7 +2083,7 @@ filename = '/build/cherrypy3-8.9.1/.pybuild/cpython2_2.7_cherrypy3/build/cherrypy/tutorial/tutorial.conf' filenames = ['/build/cherrypy3-8.9.1/.pybuild/cpython2_2.7_cherrypy3/build/cherrypy/tutorial/tutorial.conf'] -self = +self = cherrypy/lib/reprconf.py:197: IOError ________________________ TutorialTest.test04ComplexSite ________________________ @@ -2076,7 +2111,7 @@ self.read(file) _ _ _ _ _ _ _ _ _ _ _ _ _ _ _ _ _ _ _ _ _ _ _ _ _ _ _ _ _ _ _ _ _ _ _ _ _ _ _ _ -self = +self = filenames = ['/build/cherrypy3-8.9.1/.pybuild/cpython2_2.7_cherrypy3/build/cherrypy/tutorial/tutorial.conf'] def read(self, filenames): @@ -2092,7 +2127,7 @@ filename = '/build/cherrypy3-8.9.1/.pybuild/cpython2_2.7_cherrypy3/build/cherrypy/tutorial/tutorial.conf' filenames = ['/build/cherrypy3-8.9.1/.pybuild/cpython2_2.7_cherrypy3/build/cherrypy/tutorial/tutorial.conf'] -self = +self = cherrypy/lib/reprconf.py:197: IOError ______________________ TutorialTest.test05DerivedObjects _______________________ @@ -2120,7 +2155,7 @@ self.read(file) _ _ _ _ _ _ _ _ _ _ _ _ _ _ _ _ _ _ _ _ _ _ _ _ _ _ _ _ _ _ _ _ _ _ _ _ _ _ _ _ -self = +self = filenames = ['/build/cherrypy3-8.9.1/.pybuild/cpython2_2.7_cherrypy3/build/cherrypy/tutorial/tutorial.conf'] def read(self, filenames): @@ -2136,7 +2171,7 @@ filename = '/build/cherrypy3-8.9.1/.pybuild/cpython2_2.7_cherrypy3/build/cherrypy/tutorial/tutorial.conf' filenames = ['/build/cherrypy3-8.9.1/.pybuild/cpython2_2.7_cherrypy3/build/cherrypy/tutorial/tutorial.conf'] -self = +self = cherrypy/lib/reprconf.py:197: IOError _______________________ TutorialTest.test06DefaultMethod _______________________ @@ -2164,7 +2199,7 @@ self.read(file) _ _ _ _ _ _ _ _ _ _ _ _ _ _ _ _ _ _ _ _ _ _ _ _ _ _ _ _ _ _ _ _ _ _ _ _ _ _ _ _ -self = +self = filenames = ['/build/cherrypy3-8.9.1/.pybuild/cpython2_2.7_cherrypy3/build/cherrypy/tutorial/tutorial.conf'] def read(self, filenames): @@ -2180,7 +2215,7 @@ filename = '/build/cherrypy3-8.9.1/.pybuild/cpython2_2.7_cherrypy3/build/cherrypy/tutorial/tutorial.conf' filenames = ['/build/cherrypy3-8.9.1/.pybuild/cpython2_2.7_cherrypy3/build/cherrypy/tutorial/tutorial.conf'] -self = +self = cherrypy/lib/reprconf.py:197: IOError _________________________ TutorialTest.test07Sessions __________________________ @@ -2208,7 +2243,7 @@ self.read(file) _ _ _ _ _ _ _ _ _ _ _ _ _ _ _ _ _ _ _ _ _ _ _ _ _ _ _ _ _ _ _ _ _ _ _ _ _ _ _ _ -self = +self = filenames = ['/build/cherrypy3-8.9.1/.pybuild/cpython2_2.7_cherrypy3/build/cherrypy/tutorial/tutorial.conf'] def read(self, filenames): @@ -2224,7 +2259,7 @@ filename = '/build/cherrypy3-8.9.1/.pybuild/cpython2_2.7_cherrypy3/build/cherrypy/tutorial/tutorial.conf' filenames = ['/build/cherrypy3-8.9.1/.pybuild/cpython2_2.7_cherrypy3/build/cherrypy/tutorial/tutorial.conf'] -self = +self = cherrypy/lib/reprconf.py:197: IOError ____________________ TutorialTest.test08GeneratorsAndYield _____________________ @@ -2252,7 +2287,7 @@ self.read(file) _ _ _ _ _ _ _ _ _ _ _ _ _ _ _ _ _ _ _ _ _ _ _ _ _ _ _ _ _ _ _ _ _ _ _ _ _ _ _ _ -self = +self = filenames = ['/build/cherrypy3-8.9.1/.pybuild/cpython2_2.7_cherrypy3/build/cherrypy/tutorial/tutorial.conf'] def read(self, filenames): @@ -2268,7 +2303,7 @@ filename = '/build/cherrypy3-8.9.1/.pybuild/cpython2_2.7_cherrypy3/build/cherrypy/tutorial/tutorial.conf' filenames = ['/build/cherrypy3-8.9.1/.pybuild/cpython2_2.7_cherrypy3/build/cherrypy/tutorial/tutorial.conf'] -self = +self = cherrypy/lib/reprconf.py:197: IOError ___________________________ TutorialTest.test09Files ___________________________ @@ -2296,7 +2331,7 @@ self.read(file) _ _ _ _ _ _ _ _ _ _ _ _ _ _ _ _ _ _ _ _ _ _ _ _ _ _ _ _ _ _ _ _ _ _ _ _ _ _ _ _ -self = +self = filenames = ['/build/cherrypy3-8.9.1/.pybuild/cpython2_2.7_cherrypy3/build/cherrypy/tutorial/tutorial.conf'] def read(self, filenames): @@ -2312,7 +2347,7 @@ filename = '/build/cherrypy3-8.9.1/.pybuild/cpython2_2.7_cherrypy3/build/cherrypy/tutorial/tutorial.conf' filenames = ['/build/cherrypy3-8.9.1/.pybuild/cpython2_2.7_cherrypy3/build/cherrypy/tutorial/tutorial.conf'] -self = +self = cherrypy/lib/reprconf.py:197: IOError ________________________ TutorialTest.test10HTTPErrors _________________________ @@ -2340,7 +2375,7 @@ self.read(file) _ _ _ _ _ _ _ _ _ _ _ _ _ _ _ _ _ _ _ _ _ _ _ _ _ _ _ _ _ _ _ _ _ _ _ _ _ _ _ _ -self = +self = filenames = ['/build/cherrypy3-8.9.1/.pybuild/cpython2_2.7_cherrypy3/build/cherrypy/tutorial/tutorial.conf'] def read(self, filenames): @@ -2356,7 +2391,7 @@ filename = '/build/cherrypy3-8.9.1/.pybuild/cpython2_2.7_cherrypy3/build/cherrypy/tutorial/tutorial.conf' filenames = ['/build/cherrypy3-8.9.1/.pybuild/cpython2_2.7_cherrypy3/build/cherrypy/tutorial/tutorial.conf'] -self = +self = cherrypy/lib/reprconf.py:197: IOError ____________________ VirtualHostTest.test_VHost_plus_Static ____________________ @@ -2380,13 +2415,13 @@ fd = sys.stdin.fileno() _ _ _ _ _ _ _ _ _ _ _ _ _ _ _ _ _ _ _ _ _ _ _ _ _ _ _ _ _ _ _ _ _ _ _ _ _ _ _ _ -self = <_pytest.capture.DontReadFromInput object at 0x7f64ea1de290> +self = <_pytest.capture.DontReadFromInput object at 0x7f6cddba6290> def fileno(self): > raise UnsupportedOperation("redirected stdin is pseudofile, has no fileno()") E UnsupportedOperation: redirected stdin is pseudofile, has no fileno() -self = <_pytest.capture.DontReadFromInput object at 0x7f64ea1de290> +self = <_pytest.capture.DontReadFromInput object at 0x7f6cddba6290> /usr/lib/python2.7/dist-packages/_pytest/capture.py:663: UnsupportedOperation ----------------------------- Captured stdout call ----------------------------- @@ -2394,14 +2429,14 @@ ERROR: Status ('404 Not Found') != '200 OK' Show: [B]ody [H]eaders [S]tatus [U]RL; [I]gnore, [R]aise, or sys.e[X]it >> ------------------------------ Captured log call ------------------------------- -_cplogging.py 302 INFO 127.0.0.1 - - [30/Nov/2021:00:57:14] "GET /static/style.css HTTP/1.1" 404 1480 "" "" +_cplogging.py 302 INFO 127.0.0.1 - - [03/Jan/2023:09:23:43] "GET /static/style.css HTTP/1.1" 404 1480 "" "" =============================== warnings summary =============================== .pybuild/cpython2_2.7_cherrypy3/build/cherrypy/test/test_config.py::ConfigTests::testConfig /build/cherrypy3-8.9.1/.pybuild/cpython2_2.7_cherrypy3/build/cherrypy/lib/reprconf.py:246: DeprecationWarning: The compiler package is deprecated and removed in Python 3.x. import compiler -- Docs: https://docs.pytest.org/en/latest/warnings.html - 18 failed, 221 passed, 6 skipped, 2 xfailed, 3 xpassed, 1 warnings, 14 error in 93.55 seconds + 18 failed, 221 passed, 6 skipped, 2 xfailed, 3 xpassed, 1 warnings, 14 error in 78.80 seconds E: pybuild pybuild:341: test: plugin distutils failed with: exit code=1: cd /build/cherrypy3-8.9.1/.pybuild/cpython2_2.7_cherrypy3/build; python2.7 -m pytest cherrypy/test cherrypy/wsgiserver -l dh_auto_test: pybuild --test --test-pytest -i python{version} -p 2.7 returned exit code 13 make[1]: [debian/rules:15: override_dh_auto_test] Error 25 (ignored) @@ -5522,9 +5557,9 @@ dpkg-gencontrol: warning: package python-cherrypy3-doc: substitution variable ${sphinxdoc:Built-Using} unused, but is defined dh_md5sums -O--buildsystem=pybuild dh_builddeb -O--buildsystem=pybuild -dpkg-deb: building package 'python-cherrypy3-doc' in '../python-cherrypy3-doc_8.9.1-2_all.deb'. -dpkg-deb: building package 'python3-cherrypy3' in '../python3-cherrypy3_8.9.1-2_all.deb'. dpkg-deb: building package 'python-cherrypy3' in '../python-cherrypy3_8.9.1-2_all.deb'. +dpkg-deb: building package 'python3-cherrypy3' in '../python3-cherrypy3_8.9.1-2_all.deb'. +dpkg-deb: building package 'python-cherrypy3-doc' in '../python-cherrypy3-doc_8.9.1-2_all.deb'. dpkg-genbuildinfo --build=binary dpkg-genchanges --build=binary >../cherrypy3_8.9.1-2_amd64.changes dpkg-genchanges: info: binary-only upload (no source code included) @@ -5533,12 +5568,14 @@ dpkg-buildpackage: info: binary-only upload (no source included) dpkg-genchanges: info: not including original source code in upload I: copying local configuration +I: user script /srv/workspace/pbuilder/3854983/tmp/hooks/B01_cleanup starting +I: user script /srv/workspace/pbuilder/3854983/tmp/hooks/B01_cleanup finished I: unmounting dev/ptmx filesystem I: unmounting dev/pts filesystem I: unmounting dev/shm filesystem I: unmounting proc filesystem I: unmounting sys filesystem I: cleaning the build env -I: removing directory /srv/workspace/pbuilder/2033725 and its subdirectories -I: Current time: Tue Nov 30 00:58:34 -12 2021 -I: pbuilder-time-stamp: 1638277114 +I: removing directory /srv/workspace/pbuilder/3854983 and its subdirectories +I: Current time: Tue Jan 3 09:23:59 +14 2023 +I: pbuilder-time-stamp: 1672687439