Diff of the two buildlogs:

--
--- b1/build.log	2021-12-01 22:42:07.707448778 +0000
+++ b2/build.log	2021-12-01 22:45:47.971924591 +0000
@@ -1,6 +1,6 @@
 I: pbuilder: network access will be disabled during build
-I: Current time: Tue Jan  3 16:52:32 -12 2023
-I: pbuilder-time-stamp: 1672807952
+I: Current time: Thu Dec  2 12:42:09 +14 2021
+I: pbuilder-time-stamp: 1638398529
 I: Building the build Environment
 I: extracting base tarball [/var/cache/pbuilder/buster-reproducible-base.tgz]
 I: copying local configuration
@@ -18,7 +18,7 @@
 I: Extracting source
 gpgv: unknown type of key resource 'trustedkeys.kbx'
 gpgv: keyblock resource '/root/.gnupg/trustedkeys.kbx': General error
-gpgv: Signature made Mon Apr  2 12:00:21 2018 -12
+gpgv: Signature made Tue Apr  3 14:00:21 2018 +14
 gpgv:                using RSA key E9762343DA3C836A78CD254A6A63028F5A74E893
 gpgv:                issuer "ansgar@debian.org"
 gpgv: Can't check signature: No public key
@@ -28,136 +28,170 @@
 dpkg-source: info: unpacking dune-geometry_2.6.0-1.debian.tar.xz
 I: Not using root during the build.
 I: Installing the build-deps
-I: user script /srv/workspace/pbuilder/1698322/tmp/hooks/D02_print_environment starting
+I: user script /srv/workspace/pbuilder/449318/tmp/hooks/D01_modify_environment starting
+debug: Running on ionos1-amd64.
+I: Changing host+domainname to test build reproducibility
+I: Adding a custom variable just for the fun of it...
+I: Changing /bin/sh to bash
+Removing 'diversion of /bin/sh to /bin/sh.distrib by dash'
+Adding 'diversion of /bin/sh to /bin/sh.distrib by bash'
+Removing 'diversion of /usr/share/man/man1/sh.1.gz to /usr/share/man/man1/sh.distrib.1.gz by dash'
+Adding 'diversion of /usr/share/man/man1/sh.1.gz to /usr/share/man/man1/sh.distrib.1.gz by bash'
+I: Setting pbuilder2's login shell to /bin/bash
+I: Setting pbuilder2's GECOS to second user,second room,second work-phone,second home-phone,second other
+I: user script /srv/workspace/pbuilder/449318/tmp/hooks/D01_modify_environment finished
+I: user script /srv/workspace/pbuilder/449318/tmp/hooks/D02_print_environment starting
 I: set
-  BUILDDIR='/build'
-  BUILDUSERGECOS='first user,first room,first work-phone,first home-phone,first other'
-  BUILDUSERNAME='pbuilder1'
-  BUILD_ARCH='amd64'
-  DEBIAN_FRONTEND='noninteractive'
-  DEB_BUILD_OPTIONS='buildinfo=+all reproducible=+all parallel=16'
-  DISTRIBUTION=''
-  HOME='/root'
-  HOST_ARCH='amd64'
+  BASH=/bin/sh
+  BASHOPTS=checkwinsize:cmdhist:complete_fullquote:extquote:force_fignore:globasciiranges:hostcomplete:interactive_comments:progcomp:promptvars:sourcepath
+  BASH_ALIASES=()
+  BASH_ARGC=()
+  BASH_ARGV=()
+  BASH_CMDS=()
+  BASH_LINENO=([0]="12" [1]="0")
+  BASH_SOURCE=([0]="/tmp/hooks/D02_print_environment" [1]="/tmp/hooks/D02_print_environment")
+  BASH_VERSINFO=([0]="5" [1]="0" [2]="3" [3]="1" [4]="release" [5]="x86_64-pc-linux-gnu")
+  BASH_VERSION='5.0.3(1)-release'
+  BUILDDIR=/build
+  BUILDUSERGECOS='second user,second room,second work-phone,second home-phone,second other'
+  BUILDUSERNAME=pbuilder2
+  BUILD_ARCH=amd64
+  DEBIAN_FRONTEND=noninteractive
+  DEB_BUILD_OPTIONS='buildinfo=+all reproducible=+all parallel=15'
+  DIRSTACK=()
+  DISTRIBUTION=
+  EUID=0
+  FUNCNAME=([0]="Echo" [1]="main")
+  GROUPS=()
+  HOME=/root
+  HOSTNAME=i-capture-the-hostname
+  HOSTTYPE=x86_64
+  HOST_ARCH=amd64
   IFS=' 	
   '
-  INVOCATION_ID='c57285e06ba54505a024c90e188a5619'
-  LANG='C'
-  LANGUAGE='en_US:en'
-  LC_ALL='C'
-  MAIL='/var/mail/root'
-  OPTIND='1'
-  PATH='/usr/sbin:/usr/bin:/sbin:/bin:/usr/games'
-  PBCURRENTCOMMANDLINEOPERATION='build'
-  PBUILDER_OPERATION='build'
-  PBUILDER_PKGDATADIR='/usr/share/pbuilder'
-  PBUILDER_PKGLIBDIR='/usr/lib/pbuilder'
-  PBUILDER_SYSCONFDIR='/etc'
-  PPID='1698322'
-  PS1='# '
-  PS2='> '
+  INVOCATION_ID=678d7e17399a49e9acef7853fcebbb00
+  LANG=C
+  LANGUAGE=et_EE:et
+  LC_ALL=C
+  MACHTYPE=x86_64-pc-linux-gnu
+  MAIL=/var/mail/root
+  OPTERR=1
+  OPTIND=1
+  OSTYPE=linux-gnu
+  PATH=/usr/sbin:/usr/bin:/sbin:/bin:/usr/games:/i/capture/the/path
+  PBCURRENTCOMMANDLINEOPERATION=build
+  PBUILDER_OPERATION=build
+  PBUILDER_PKGDATADIR=/usr/share/pbuilder
+  PBUILDER_PKGLIBDIR=/usr/lib/pbuilder
+  PBUILDER_SYSCONFDIR=/etc
+  PIPESTATUS=([0]="0")
+  POSIXLY_CORRECT=y
+  PPID=449318
   PS4='+ '
-  PWD='/'
-  SHELL='/bin/bash'
-  SHLVL='2'
-  SUDO_COMMAND='/usr/bin/timeout -k 18.1h 18h /usr/bin/ionice -c 3 /usr/bin/nice /usr/sbin/pbuilder --build --configfile /srv/reproducible-results/rbuild-debian/tmp.evVDvqI3OH/pbuilderrc_Oe1w --hookdir /etc/pbuilder/first-build-hooks --debbuildopts -b --basetgz /var/cache/pbuilder/buster-reproducible-base.tgz --buildresult /srv/reproducible-results/rbuild-debian/tmp.evVDvqI3OH/b1 --logfile b1/build.log dune-geometry_2.6.0-1.dsc'
-  SUDO_GID='110'
-  SUDO_UID='105'
-  SUDO_USER='jenkins'
-  TERM='unknown'
-  TZ='/usr/share/zoneinfo/Etc/GMT+12'
-  USER='root'
-  _='/usr/bin/systemd-run'
-  http_proxy='http://85.184.249.68:3128'
+  PWD=/
+  SHELL=/bin/bash
+  SHELLOPTS=braceexpand:errexit:hashall:interactive-comments:posix
+  SHLVL=3
+  SUDO_COMMAND='/usr/bin/timeout -k 24.1h 24h /usr/bin/ionice -c 3 /usr/bin/nice -n 11 /usr/bin/unshare --uts -- /usr/sbin/pbuilder --build --configfile /srv/reproducible-results/rbuild-debian/tmp.evVDvqI3OH/pbuilderrc_Dw3D --hookdir /etc/pbuilder/rebuild-hooks --debbuildopts -b --basetgz /var/cache/pbuilder/buster-reproducible-base.tgz --buildresult /srv/reproducible-results/rbuild-debian/tmp.evVDvqI3OH/b2 --logfile b2/build.log dune-geometry_2.6.0-1.dsc'
+  SUDO_GID=110
+  SUDO_UID=105
+  SUDO_USER=jenkins
+  TERM=unknown
+  TZ=/usr/share/zoneinfo/Etc/GMT-14
+  UID=0
+  USER=root
+  _='I: set'
+  http_proxy=http://78.137.99.97:3128
 I: uname -a
-  Linux ionos5-amd64 5.14.0-0.bpo.2-amd64 #1 SMP Debian 5.14.9-2~bpo11+1 (2021-10-10) x86_64 GNU/Linux
+  Linux i-capture-the-hostname 5.10.0-9-amd64 #1 SMP Debian 5.10.70-1 (2021-09-30) x86_64 GNU/Linux
 I: ls -l /bin
   total 5116
-  -rwxr-xr-x 1 root root 1168776 Apr 17  2019 bash
-  -rwxr-xr-x 3 root root   38984 Jul 10  2019 bunzip2
-  -rwxr-xr-x 3 root root   38984 Jul 10  2019 bzcat
-  lrwxrwxrwx 1 root root       6 Jul 10  2019 bzcmp -> bzdiff
-  -rwxr-xr-x 1 root root    2227 Jul 10  2019 bzdiff
-  lrwxrwxrwx 1 root root       6 Jul 10  2019 bzegrep -> bzgrep
-  -rwxr-xr-x 1 root root    4877 Jun 24  2019 bzexe
-  lrwxrwxrwx 1 root root       6 Jul 10  2019 bzfgrep -> bzgrep
-  -rwxr-xr-x 1 root root    3641 Jul 10  2019 bzgrep
-  -rwxr-xr-x 3 root root   38984 Jul 10  2019 bzip2
-  -rwxr-xr-x 1 root root   14328 Jul 10  2019 bzip2recover
-  lrwxrwxrwx 1 root root       6 Jul 10  2019 bzless -> bzmore
-  -rwxr-xr-x 1 root root    1297 Jul 10  2019 bzmore
-  -rwxr-xr-x 1 root root   43744 Feb 28  2019 cat
-  -rwxr-xr-x 1 root root   64320 Feb 28  2019 chgrp
-  -rwxr-xr-x 1 root root   64288 Feb 28  2019 chmod
-  -rwxr-xr-x 1 root root   72512 Feb 28  2019 chown
-  -rwxr-xr-x 1 root root  146880 Feb 28  2019 cp
-  -rwxr-xr-x 1 root root  121464 Jan 17  2019 dash
-  -rwxr-xr-x 1 root root  109408 Feb 28  2019 date
-  -rwxr-xr-x 1 root root   76712 Feb 28  2019 dd
-  -rwxr-xr-x 1 root root   93744 Feb 28  2019 df
-  -rwxr-xr-x 1 root root  138856 Feb 28  2019 dir
-  -rwxr-xr-x 1 root root   84288 Jan  9  2019 dmesg
-  lrwxrwxrwx 1 root root       8 Sep 26  2018 dnsdomainname -> hostname
-  lrwxrwxrwx 1 root root       8 Sep 26  2018 domainname -> hostname
-  -rwxr-xr-x 1 root root   39520 Feb 28  2019 echo
-  -rwxr-xr-x 1 root root      28 Jan  7  2019 egrep
-  -rwxr-xr-x 1 root root   35424 Feb 28  2019 false
-  -rwxr-xr-x 1 root root      28 Jan  7  2019 fgrep
-  -rwxr-xr-x 1 root root   68880 Jan  9  2019 findmnt
-  -rwsr-xr-x 1 root root   34896 Apr 22  2020 fusermount
-  -rwxr-xr-x 1 root root  198976 Jan  7  2019 grep
-  -rwxr-xr-x 2 root root    2345 Jan  5  2019 gunzip
-  -rwxr-xr-x 1 root root    6375 Jan  5  2019 gzexe
-  -rwxr-xr-x 1 root root   98048 Jan  5  2019 gzip
-  -rwxr-xr-x 1 root root   26696 Sep 26  2018 hostname
-  -rwxr-xr-x 1 root root   68552 Feb 28  2019 ln
-  -rwxr-xr-x 1 root root   56760 Jul 26  2018 login
-  -rwxr-xr-x 1 root root  138856 Feb 28  2019 ls
-  -rwxr-xr-x 1 root root  108624 Jan  9  2019 lsblk
-  -rwxr-xr-x 1 root root   89088 Feb 28  2019 mkdir
-  -rwxr-xr-x 1 root root   68544 Feb 28  2019 mknod
-  -rwxr-xr-x 1 root root   43808 Feb 28  2019 mktemp
-  -rwxr-xr-x 1 root root   43008 Jan  9  2019 more
-  -rwsr-xr-x 1 root root   51280 Jan  9  2019 mount
-  -rwxr-xr-x 1 root root   14408 Jan  9  2019 mountpoint
-  -rwxr-xr-x 1 root root  138728 Feb 28  2019 mv
-  lrwxrwxrwx 1 root root       8 Sep 26  2018 nisdomainname -> hostname
-  lrwxrwxrwx 1 root root      14 Feb 14  2019 pidof -> /sbin/killall5
-  -rwxr-xr-x 1 root root   39616 Feb 28  2019 pwd
-  lrwxrwxrwx 1 root root       4 Apr 17  2019 rbash -> bash
-  -rwxr-xr-x 1 root root   47776 Feb 28  2019 readlink
-  -rwxr-xr-x 1 root root   68416 Feb 28  2019 rm
-  -rwxr-xr-x 1 root root   47776 Feb 28  2019 rmdir
-  -rwxr-xr-x 1 root root   23312 Jan 21  2019 run-parts
-  -rwxr-xr-x 1 root root  122224 Dec 22  2018 sed
-  lrwxrwxrwx 1 root root       4 Dec 10 16:21 sh -> dash
-  -rwxr-xr-x 1 root root   39552 Feb 28  2019 sleep
-  -rwxr-xr-x 1 root root   80672 Feb 28  2019 stty
-  -rwsr-xr-x 1 root root   63568 Jan  9  2019 su
-  -rwxr-xr-x 1 root root   35488 Feb 28  2019 sync
-  -rwxr-xr-x 1 root root  445560 Apr 23  2019 tar
-  -rwxr-xr-x 1 root root   14440 Jan 21  2019 tempfile
-  -rwxr-xr-x 1 root root   97152 Feb 28  2019 touch
-  -rwxr-xr-x 1 root root   35424 Feb 28  2019 true
-  -rwxr-xr-x 1 root root   14328 Apr 22  2020 ulockmgr_server
-  -rwsr-xr-x 1 root root   34888 Jan  9  2019 umount
-  -rwxr-xr-x 1 root root   39584 Feb 28  2019 uname
-  -rwxr-xr-x 2 root root    2345 Jan  5  2019 uncompress
-  -rwxr-xr-x 1 root root  138856 Feb 28  2019 vdir
-  -rwxr-xr-x 1 root root   34896 Jan  9  2019 wdctl
-  -rwxr-xr-x 1 root root     946 Jan 21  2019 which
-  lrwxrwxrwx 1 root root       8 Sep 26  2018 ypdomainname -> hostname
-  -rwxr-xr-x 1 root root    1983 Jan  5  2019 zcat
-  -rwxr-xr-x 1 root root    1677 Jan  5  2019 zcmp
-  -rwxr-xr-x 1 root root    5879 Jan  5  2019 zdiff
-  -rwxr-xr-x 1 root root      29 Jan  5  2019 zegrep
-  -rwxr-xr-x 1 root root      29 Jan  5  2019 zfgrep
-  -rwxr-xr-x 1 root root    2080 Jan  5  2019 zforce
-  -rwxr-xr-x 1 root root    7584 Jan  5  2019 zgrep
-  -rwxr-xr-x 1 root root    2205 Jan  5  2019 zless
-  -rwxr-xr-x 1 root root    1841 Jan  5  2019 zmore
-  -rwxr-xr-x 1 root root    4552 Jan  5  2019 znew
-I: user script /srv/workspace/pbuilder/1698322/tmp/hooks/D02_print_environment finished
+  -rwxr-xr-x 1 root root 1168776 Apr 18  2019 bash
+  -rwxr-xr-x 3 root root   38984 Jul 11  2019 bunzip2
+  -rwxr-xr-x 3 root root   38984 Jul 11  2019 bzcat
+  lrwxrwxrwx 1 root root       6 Jul 11  2019 bzcmp -> bzdiff
+  -rwxr-xr-x 1 root root    2227 Jul 11  2019 bzdiff
+  lrwxrwxrwx 1 root root       6 Jul 11  2019 bzegrep -> bzgrep
+  -rwxr-xr-x 1 root root    4877 Jun 25  2019 bzexe
+  lrwxrwxrwx 1 root root       6 Jul 11  2019 bzfgrep -> bzgrep
+  -rwxr-xr-x 1 root root    3641 Jul 11  2019 bzgrep
+  -rwxr-xr-x 3 root root   38984 Jul 11  2019 bzip2
+  -rwxr-xr-x 1 root root   14328 Jul 11  2019 bzip2recover
+  lrwxrwxrwx 1 root root       6 Jul 11  2019 bzless -> bzmore
+  -rwxr-xr-x 1 root root    1297 Jul 11  2019 bzmore
+  -rwxr-xr-x 1 root root   43744 Mar  1  2019 cat
+  -rwxr-xr-x 1 root root   64320 Mar  1  2019 chgrp
+  -rwxr-xr-x 1 root root   64288 Mar  1  2019 chmod
+  -rwxr-xr-x 1 root root   72512 Mar  1  2019 chown
+  -rwxr-xr-x 1 root root  146880 Mar  1  2019 cp
+  -rwxr-xr-x 1 root root  121464 Jan 18  2019 dash
+  -rwxr-xr-x 1 root root  109408 Mar  1  2019 date
+  -rwxr-xr-x 1 root root   76712 Mar  1  2019 dd
+  -rwxr-xr-x 1 root root   93744 Mar  1  2019 df
+  -rwxr-xr-x 1 root root  138856 Mar  1  2019 dir
+  -rwxr-xr-x 1 root root   84288 Jan 10  2019 dmesg
+  lrwxrwxrwx 1 root root       8 Sep 27  2018 dnsdomainname -> hostname
+  lrwxrwxrwx 1 root root       8 Sep 27  2018 domainname -> hostname
+  -rwxr-xr-x 1 root root   39520 Mar  1  2019 echo
+  -rwxr-xr-x 1 root root      28 Jan  8  2019 egrep
+  -rwxr-xr-x 1 root root   35424 Mar  1  2019 false
+  -rwxr-xr-x 1 root root      28 Jan  8  2019 fgrep
+  -rwxr-xr-x 1 root root   68880 Jan 10  2019 findmnt
+  -rwsr-xr-x 1 root root   34896 Apr 23  2020 fusermount
+  -rwxr-xr-x 1 root root  198976 Jan  8  2019 grep
+  -rwxr-xr-x 2 root root    2345 Jan  6  2019 gunzip
+  -rwxr-xr-x 1 root root    6375 Jan  6  2019 gzexe
+  -rwxr-xr-x 1 root root   98048 Jan  6  2019 gzip
+  -rwxr-xr-x 1 root root   26696 Sep 27  2018 hostname
+  -rwxr-xr-x 1 root root   68552 Mar  1  2019 ln
+  -rwxr-xr-x 1 root root   56760 Jul 27  2018 login
+  -rwxr-xr-x 1 root root  138856 Mar  1  2019 ls
+  -rwxr-xr-x 1 root root  108624 Jan 10  2019 lsblk
+  -rwxr-xr-x 1 root root   89088 Mar  1  2019 mkdir
+  -rwxr-xr-x 1 root root   68544 Mar  1  2019 mknod
+  -rwxr-xr-x 1 root root   43808 Mar  1  2019 mktemp
+  -rwxr-xr-x 1 root root   43008 Jan 10  2019 more
+  -rwsr-xr-x 1 root root   51280 Jan 10  2019 mount
+  -rwxr-xr-x 1 root root   14408 Jan 10  2019 mountpoint
+  -rwxr-xr-x 1 root root  138728 Mar  1  2019 mv
+  lrwxrwxrwx 1 root root       8 Sep 27  2018 nisdomainname -> hostname
+  lrwxrwxrwx 1 root root      14 Feb 15  2019 pidof -> /sbin/killall5
+  -rwxr-xr-x 1 root root   39616 Mar  1  2019 pwd
+  lrwxrwxrwx 1 root root       4 Apr 18  2019 rbash -> bash
+  -rwxr-xr-x 1 root root   47776 Mar  1  2019 readlink
+  -rwxr-xr-x 1 root root   68416 Mar  1  2019 rm
+  -rwxr-xr-x 1 root root   47776 Mar  1  2019 rmdir
+  -rwxr-xr-x 1 root root   23312 Jan 22  2019 run-parts
+  -rwxr-xr-x 1 root root  122224 Dec 23  2018 sed
+  lrwxrwxrwx 1 root root       4 Dec  2 12:42 sh -> bash
+  lrwxrwxrwx 1 root root       4 Nov  8 11:58 sh.distrib -> dash
+  -rwxr-xr-x 1 root root   39552 Mar  1  2019 sleep
+  -rwxr-xr-x 1 root root   80672 Mar  1  2019 stty
+  -rwsr-xr-x 1 root root   63568 Jan 10  2019 su
+  -rwxr-xr-x 1 root root   35488 Mar  1  2019 sync
+  -rwxr-xr-x 1 root root  445560 Apr 24  2019 tar
+  -rwxr-xr-x 1 root root   14440 Jan 22  2019 tempfile
+  -rwxr-xr-x 1 root root   97152 Mar  1  2019 touch
+  -rwxr-xr-x 1 root root   35424 Mar  1  2019 true
+  -rwxr-xr-x 1 root root   14328 Apr 23  2020 ulockmgr_server
+  -rwsr-xr-x 1 root root   34888 Jan 10  2019 umount
+  -rwxr-xr-x 1 root root   39584 Mar  1  2019 uname
+  -rwxr-xr-x 2 root root    2345 Jan  6  2019 uncompress
+  -rwxr-xr-x 1 root root  138856 Mar  1  2019 vdir
+  -rwxr-xr-x 1 root root   34896 Jan 10  2019 wdctl
+  -rwxr-xr-x 1 root root     946 Jan 22  2019 which
+  lrwxrwxrwx 1 root root       8 Sep 27  2018 ypdomainname -> hostname
+  -rwxr-xr-x 1 root root    1983 Jan  6  2019 zcat
+  -rwxr-xr-x 1 root root    1677 Jan  6  2019 zcmp
+  -rwxr-xr-x 1 root root    5879 Jan  6  2019 zdiff
+  -rwxr-xr-x 1 root root      29 Jan  6  2019 zegrep
+  -rwxr-xr-x 1 root root      29 Jan  6  2019 zfgrep
+  -rwxr-xr-x 1 root root    2080 Jan  6  2019 zforce
+  -rwxr-xr-x 1 root root    7584 Jan  6  2019 zgrep
+  -rwxr-xr-x 1 root root    2205 Jan  6  2019 zless
+  -rwxr-xr-x 1 root root    1841 Jan  6  2019 zmore
+  -rwxr-xr-x 1 root root    4552 Jan  6  2019 znew
+I: user script /srv/workspace/pbuilder/449318/tmp/hooks/D02_print_environment finished
  -> Attempting to satisfy build-dependencies
  -> Creating pbuilder-satisfydepends-dummy package
 Package: pbuilder-satisfydepends-dummy
@@ -495,7 +529,7 @@
 Get: 270 http://deb.debian.org/debian buster/main amd64 texlive-latex-recommended all 2018.20190227-2 [15.2 MB]
 Get: 271 http://deb.debian.org/debian buster/main amd64 texlive-pictures all 2018.20190227-2 [8201 kB]
 Get: 272 http://deb.debian.org/debian buster/main amd64 texlive-latex-extra all 2018.20190227-2 [12.3 MB]
-Fetched 228 MB in 8s (29.8 MB/s)
+Fetched 228 MB in 3s (75.8 MB/s)
 debconf: delaying package configuration, since apt-utils is not installed
 Selecting previously unselected package libbsd0:amd64.
 (Reading database ... 
(Reading database ... 5%
(Reading database ... 10%
(Reading database ... 15%
(Reading database ... 20%
(Reading database ... 25%
(Reading database ... 30%
(Reading database ... 35%
(Reading database ... 40%
(Reading database ... 45%
(Reading database ... 50%
(Reading database ... 55%
(Reading database ... 60%
(Reading database ... 65%
(Reading database ... 70%
(Reading database ... 75%
(Reading database ... 80%
(Reading database ... 85%
(Reading database ... 90%
(Reading database ... 95%
(Reading database ... 100%
(Reading database ... 19195 files and directories currently installed.)
@@ -1681,7 +1715,8 @@
 Building tag database...
  -> Finished parsing the build-deps
 I: Building the package
-I: Running cd /build/dune-geometry-2.6.0/ && env PATH="/usr/sbin:/usr/bin:/sbin:/bin:/usr/games" HOME="/nonexistent/first-build" dpkg-buildpackage -us -uc -b && env PATH="/usr/sbin:/usr/bin:/sbin:/bin:/usr/games" HOME="/nonexistent/first-build" dpkg-genchanges -S  > ../dune-geometry_2.6.0-1_source.changes
+hostname: Name or service not known
+I: Running cd /build/dune-geometry-2.6.0/ && env PATH="/usr/sbin:/usr/bin:/sbin:/bin:/usr/games:/i/capture/the/path" HOME="/nonexistent/second-build" dpkg-buildpackage -us -uc -b && env PATH="/usr/sbin:/usr/bin:/sbin:/bin:/usr/games:/i/capture/the/path" HOME="/nonexistent/second-build" dpkg-genchanges -S  > ../dune-geometry_2.6.0-1_source.changes
 dpkg-buildpackage: info: source package dune-geometry
 dpkg-buildpackage: info: source version 2.6.0-1
 dpkg-buildpackage: info: source distribution unstable
@@ -1855,7 +1890,7 @@
 -- Build files have been written to: /build/dune-geometry-2.6.0/build
 make[1]: Leaving directory '/build/dune-geometry-2.6.0'
    dh_auto_build -O--parallel -O--builddirectory=build
-	cd build && make -j16
+	cd build && make -j15
 make[1]: Entering directory '/build/dune-geometry-2.6.0/build'
 /usr/bin/cmake -S/build/dune-geometry-2.6.0 -B/build/dune-geometry-2.6.0/build --check-build-system CMakeFiles/Makefile.cmake 0
 /usr/bin/cmake -E cmake_progress_start /build/dune-geometry-2.6.0/build/CMakeFiles /build/dune-geometry-2.6.0/build/CMakeFiles/progress.marks
@@ -1869,17 +1904,17 @@
 make -f lib/CMakeFiles/dunegeometry.dir/build.make lib/CMakeFiles/dunegeometry.dir/build
 make[3]: Entering directory '/build/dune-geometry-2.6.0/build'
 [ 14%] Building CXX object lib/CMakeFiles/dunegeometry.dir/__/dune/geometry/referenceelementimplementation.cc.o
-[ 28%] Building CXX object lib/CMakeFiles/dunegeometry.dir/__/dune/geometry/quadraturerules/gauss.cc.o
+[ 28%] Building CXX object lib/CMakeFiles/dunegeometry.dir/__/dune/geometry/quadraturerules/jacobi_2_0.cc.o
 cd /build/dune-geometry-2.6.0/build/lib && /usr/bin/c++  -DENABLE_TBB=1 -DHAVE_CONFIG_H -D_TBB_CPP0X -Ddunegeometry_EXPORTS -I/build/dune-geometry-2.6.0/build -I/build/dune-geometry-2.6.0 -I/usr/lib/x86_64-linux-gnu/openmpi/include/openmpi -I/usr/lib/x86_64-linux-gnu/openmpi/include  -std=c++17 -g -O2 -ffile-prefix-map=/build/dune-geometry-2.6.0=. -fstack-protector-strong -Wformat -Werror=format-security -Wdate-time -D_FORTIFY_SOURCE=2 -fPIC   -o CMakeFiles/dunegeometry.dir/__/dune/geometry/referenceelementimplementation.cc.o -c /build/dune-geometry-2.6.0/dune/geometry/referenceelementimplementation.cc
-cd /build/dune-geometry-2.6.0/build/lib && /usr/bin/c++  -DENABLE_TBB=1 -DHAVE_CONFIG_H -D_TBB_CPP0X -Ddunegeometry_EXPORTS -I/build/dune-geometry-2.6.0/build -I/build/dune-geometry-2.6.0 -I/usr/lib/x86_64-linux-gnu/openmpi/include/openmpi -I/usr/lib/x86_64-linux-gnu/openmpi/include  -std=c++17 -g -O2 -ffile-prefix-map=/build/dune-geometry-2.6.0=. -fstack-protector-strong -Wformat -Werror=format-security -Wdate-time -D_FORTIFY_SOURCE=2 -fPIC   -o CMakeFiles/dunegeometry.dir/__/dune/geometry/quadraturerules/gauss.cc.o -c /build/dune-geometry-2.6.0/dune/geometry/quadraturerules/gauss.cc
-[ 42%] Building CXX object lib/CMakeFiles/dunegeometry.dir/__/dune/geometry/quadraturerules/jacobi_1_0.cc.o
-cd /build/dune-geometry-2.6.0/build/lib && /usr/bin/c++  -DENABLE_TBB=1 -DHAVE_CONFIG_H -D_TBB_CPP0X -Ddunegeometry_EXPORTS -I/build/dune-geometry-2.6.0/build -I/build/dune-geometry-2.6.0 -I/usr/lib/x86_64-linux-gnu/openmpi/include/openmpi -I/usr/lib/x86_64-linux-gnu/openmpi/include  -std=c++17 -g -O2 -ffile-prefix-map=/build/dune-geometry-2.6.0=. -fstack-protector-strong -Wformat -Werror=format-security -Wdate-time -D_FORTIFY_SOURCE=2 -fPIC   -o CMakeFiles/dunegeometry.dir/__/dune/geometry/quadraturerules/jacobi_1_0.cc.o -c /build/dune-geometry-2.6.0/dune/geometry/quadraturerules/jacobi_1_0.cc
-[ 57%] Building CXX object lib/CMakeFiles/dunegeometry.dir/__/dune/geometry/quadraturerules/jacobi_2_0.cc.o
-[ 71%] Building CXX object lib/CMakeFiles/dunegeometry.dir/__/dune/geometry/quadraturerules/quadraturerules.cc.o
+[ 57%] Building CXX object lib/CMakeFiles/dunegeometry.dir/__/dune/geometry/quadraturerules/jacobi_1_0.cc.o
+[ 57%] Building CXX object lib/CMakeFiles/dunegeometry.dir/__/dune/geometry/quadraturerules/gausslobatto.cc.o
 cd /build/dune-geometry-2.6.0/build/lib && /usr/bin/c++  -DENABLE_TBB=1 -DHAVE_CONFIG_H -D_TBB_CPP0X -Ddunegeometry_EXPORTS -I/build/dune-geometry-2.6.0/build -I/build/dune-geometry-2.6.0 -I/usr/lib/x86_64-linux-gnu/openmpi/include/openmpi -I/usr/lib/x86_64-linux-gnu/openmpi/include  -std=c++17 -g -O2 -ffile-prefix-map=/build/dune-geometry-2.6.0=. -fstack-protector-strong -Wformat -Werror=format-security -Wdate-time -D_FORTIFY_SOURCE=2 -fPIC   -o CMakeFiles/dunegeometry.dir/__/dune/geometry/quadraturerules/jacobi_2_0.cc.o -c /build/dune-geometry-2.6.0/dune/geometry/quadraturerules/jacobi_2_0.cc
-cd /build/dune-geometry-2.6.0/build/lib && /usr/bin/c++  -DENABLE_TBB=1 -DHAVE_CONFIG_H -D_TBB_CPP0X -Ddunegeometry_EXPORTS -I/build/dune-geometry-2.6.0/build -I/build/dune-geometry-2.6.0 -I/usr/lib/x86_64-linux-gnu/openmpi/include/openmpi -I/usr/lib/x86_64-linux-gnu/openmpi/include  -std=c++17 -g -O2 -ffile-prefix-map=/build/dune-geometry-2.6.0=. -fstack-protector-strong -Wformat -Werror=format-security -Wdate-time -D_FORTIFY_SOURCE=2 -fPIC   -o CMakeFiles/dunegeometry.dir/__/dune/geometry/quadraturerules/quadraturerules.cc.o -c /build/dune-geometry-2.6.0/dune/geometry/quadraturerules/quadraturerules.cc
-[ 85%] Building CXX object lib/CMakeFiles/dunegeometry.dir/__/dune/geometry/quadraturerules/gausslobatto.cc.o
+[ 71%] Building CXX object lib/CMakeFiles/dunegeometry.dir/__/dune/geometry/quadraturerules/quadraturerules.cc.o
+cd /build/dune-geometry-2.6.0/build/lib && /usr/bin/c++  -DENABLE_TBB=1 -DHAVE_CONFIG_H -D_TBB_CPP0X -Ddunegeometry_EXPORTS -I/build/dune-geometry-2.6.0/build -I/build/dune-geometry-2.6.0 -I/usr/lib/x86_64-linux-gnu/openmpi/include/openmpi -I/usr/lib/x86_64-linux-gnu/openmpi/include  -std=c++17 -g -O2 -ffile-prefix-map=/build/dune-geometry-2.6.0=. -fstack-protector-strong -Wformat -Werror=format-security -Wdate-time -D_FORTIFY_SOURCE=2 -fPIC   -o CMakeFiles/dunegeometry.dir/__/dune/geometry/quadraturerules/jacobi_1_0.cc.o -c /build/dune-geometry-2.6.0/dune/geometry/quadraturerules/jacobi_1_0.cc
 cd /build/dune-geometry-2.6.0/build/lib && /usr/bin/c++  -DENABLE_TBB=1 -DHAVE_CONFIG_H -D_TBB_CPP0X -Ddunegeometry_EXPORTS -I/build/dune-geometry-2.6.0/build -I/build/dune-geometry-2.6.0 -I/usr/lib/x86_64-linux-gnu/openmpi/include/openmpi -I/usr/lib/x86_64-linux-gnu/openmpi/include  -std=c++17 -g -O2 -ffile-prefix-map=/build/dune-geometry-2.6.0=. -fstack-protector-strong -Wformat -Werror=format-security -Wdate-time -D_FORTIFY_SOURCE=2 -fPIC   -o CMakeFiles/dunegeometry.dir/__/dune/geometry/quadraturerules/gausslobatto.cc.o -c /build/dune-geometry-2.6.0/dune/geometry/quadraturerules/gausslobatto.cc
+cd /build/dune-geometry-2.6.0/build/lib && /usr/bin/c++  -DENABLE_TBB=1 -DHAVE_CONFIG_H -D_TBB_CPP0X -Ddunegeometry_EXPORTS -I/build/dune-geometry-2.6.0/build -I/build/dune-geometry-2.6.0 -I/usr/lib/x86_64-linux-gnu/openmpi/include/openmpi -I/usr/lib/x86_64-linux-gnu/openmpi/include  -std=c++17 -g -O2 -ffile-prefix-map=/build/dune-geometry-2.6.0=. -fstack-protector-strong -Wformat -Werror=format-security -Wdate-time -D_FORTIFY_SOURCE=2 -fPIC   -o CMakeFiles/dunegeometry.dir/__/dune/geometry/quadraturerules/quadraturerules.cc.o -c /build/dune-geometry-2.6.0/dune/geometry/quadraturerules/quadraturerules.cc
+[ 85%] Building CXX object lib/CMakeFiles/dunegeometry.dir/__/dune/geometry/quadraturerules/gauss.cc.o
+cd /build/dune-geometry-2.6.0/build/lib && /usr/bin/c++  -DENABLE_TBB=1 -DHAVE_CONFIG_H -D_TBB_CPP0X -Ddunegeometry_EXPORTS -I/build/dune-geometry-2.6.0/build -I/build/dune-geometry-2.6.0 -I/usr/lib/x86_64-linux-gnu/openmpi/include/openmpi -I/usr/lib/x86_64-linux-gnu/openmpi/include  -std=c++17 -g -O2 -ffile-prefix-map=/build/dune-geometry-2.6.0=. -fstack-protector-strong -Wformat -Werror=format-security -Wdate-time -D_FORTIFY_SOURCE=2 -fPIC   -o CMakeFiles/dunegeometry.dir/__/dune/geometry/quadraturerules/gauss.cc.o -c /build/dune-geometry-2.6.0/dune/geometry/quadraturerules/gauss.cc
 [100%] Linking CXX shared library libdunegeometry.so
 cd /build/dune-geometry-2.6.0/build/lib && /usr/bin/cmake -E cmake_link_script CMakeFiles/dunegeometry.dir/link.txt --verbose=1
 /usr/bin/c++ -fPIC -std=c++17 -g -O2 -ffile-prefix-map=/build/dune-geometry-2.6.0=. -fstack-protector-strong -Wformat -Werror=format-security -Wdate-time -D_FORTIFY_SOURCE=2 -Wl,-z,relro -shared -Wl,-soname,libdunegeometry.so.2.6-git -o libdunegeometry.so.2.6-git CMakeFiles/dunegeometry.dir/__/dune/geometry/referenceelementimplementation.cc.o CMakeFiles/dunegeometry.dir/__/dune/geometry/quadraturerules/gauss.cc.o CMakeFiles/dunegeometry.dir/__/dune/geometry/quadraturerules/jacobi_1_0.cc.o CMakeFiles/dunegeometry.dir/__/dune/geometry/quadraturerules/jacobi_2_0.cc.o CMakeFiles/dunegeometry.dir/__/dune/geometry/quadraturerules/quadraturerules.cc.o CMakeFiles/dunegeometry.dir/__/dune/geometry/quadraturerules/gausslobatto.cc.o /usr/lib/x86_64-linux-gnu/libdunecommon.so.2.6-git 
@@ -1892,7 +1927,7 @@
    debian/rules override_dh_auto_test
 make[1]: Entering directory '/build/dune-geometry-2.6.0'
 dh_auto_build -- build_tests
-	cd build && make -j16 build_tests
+	cd build && make -j15 build_tests
 make[2]: Entering directory '/build/dune-geometry-2.6.0/build'
 /usr/bin/cmake -S/build/dune-geometry-2.6.0 -B/build/dune-geometry-2.6.0/build --check-build-system CMakeFiles/Makefile.cmake 0
 make -f CMakeFiles/Makefile2 build_tests
@@ -1902,102 +1937,102 @@
 make -f CMakeFiles/Makefile2 CMakeFiles/build_tests.dir/all
 make[4]: Entering directory '/build/dune-geometry-2.6.0/build'
 make -f lib/CMakeFiles/dunegeometry.dir/build.make lib/CMakeFiles/dunegeometry.dir/depend
-make[5]: Entering directory '/build/dune-geometry-2.6.0/build'
-cd /build/dune-geometry-2.6.0/build && /usr/bin/cmake -E cmake_depends "Unix Makefiles" /build/dune-geometry-2.6.0 /build/dune-geometry-2.6.0/lib /build/dune-geometry-2.6.0/build /build/dune-geometry-2.6.0/build/lib /build/dune-geometry-2.6.0/build/lib/CMakeFiles/dunegeometry.dir/DependInfo.cmake --color=
 make -f dune/geometry/test/CMakeFiles/test-fromvertexcount.dir/build.make dune/geometry/test/CMakeFiles/test-fromvertexcount.dir/depend
 make[5]: Entering directory '/build/dune-geometry-2.6.0/build'
+make[5]: Entering directory '/build/dune-geometry-2.6.0/build'
+cd /build/dune-geometry-2.6.0/build && /usr/bin/cmake -E cmake_depends "Unix Makefiles" /build/dune-geometry-2.6.0 /build/dune-geometry-2.6.0/lib /build/dune-geometry-2.6.0/build /build/dune-geometry-2.6.0/build/lib /build/dune-geometry-2.6.0/build/lib/CMakeFiles/dunegeometry.dir/DependInfo.cmake --color=
 cd /build/dune-geometry-2.6.0/build && /usr/bin/cmake -E cmake_depends "Unix Makefiles" /build/dune-geometry-2.6.0 /build/dune-geometry-2.6.0/dune/geometry/test /build/dune-geometry-2.6.0/build /build/dune-geometry-2.6.0/build/dune/geometry/test /build/dune-geometry-2.6.0/build/dune/geometry/test/CMakeFiles/test-fromvertexcount.dir/DependInfo.cmake --color=
+Scanning dependencies of target test-fromvertexcount
 make[5]: Leaving directory '/build/dune-geometry-2.6.0/build'
 make -f lib/CMakeFiles/dunegeometry.dir/build.make lib/CMakeFiles/dunegeometry.dir/build
+make[5]: Leaving directory '/build/dune-geometry-2.6.0/build'
+make -f dune/geometry/test/CMakeFiles/test-fromvertexcount.dir/build.make dune/geometry/test/CMakeFiles/test-fromvertexcount.dir/build
 make[5]: Entering directory '/build/dune-geometry-2.6.0/build'
 make[5]: Nothing to be done for 'lib/CMakeFiles/dunegeometry.dir/build'.
 make[5]: Leaving directory '/build/dune-geometry-2.6.0/build'
+make[5]: Entering directory '/build/dune-geometry-2.6.0/build'
 [ 25%] Built target dunegeometry
 make -f dune/geometry/test/CMakeFiles/test-constexpr-geometrytype.dir/build.make dune/geometry/test/CMakeFiles/test-constexpr-geometrytype.dir/depend
-make[5]: Entering directory '/build/dune-geometry-2.6.0/build'
-cd /build/dune-geometry-2.6.0/build && /usr/bin/cmake -E cmake_depends "Unix Makefiles" /build/dune-geometry-2.6.0 /build/dune-geometry-2.6.0/dune/geometry/test /build/dune-geometry-2.6.0/build /build/dune-geometry-2.6.0/build/dune/geometry/test /build/dune-geometry-2.6.0/build/dune/geometry/test/CMakeFiles/test-constexpr-geometrytype.dir/DependInfo.cmake --color=
 make -f dune/geometry/test/CMakeFiles/test-quadrature.dir/build.make dune/geometry/test/CMakeFiles/test-quadrature.dir/depend
-Scanning dependencies of target test-fromvertexcount
 make -f dune/geometry/test/CMakeFiles/test-affinegeometry.dir/build.make dune/geometry/test/CMakeFiles/test-affinegeometry.dir/depend
+make -f dune/geometry/test/CMakeFiles/test-cornerstoragerefwrap.dir/build.make dune/geometry/test/CMakeFiles/test-cornerstoragerefwrap.dir/depend
+make -f dune/geometry/test/CMakeFiles/test-referenceelements.dir/build.make dune/geometry/test/CMakeFiles/test-referenceelements.dir/depend
+make -f dune/geometry/test/CMakeFiles/test-multilineargeometry.dir/build.make dune/geometry/test/CMakeFiles/test-multilineargeometry.dir/depend
+make[5]: Entering directory '/build/dune-geometry-2.6.0/build'
+cd /build/dune-geometry-2.6.0/build && /usr/bin/cmake -E cmake_depends "Unix Makefiles" /build/dune-geometry-2.6.0 /build/dune-geometry-2.6.0/dune/geometry/test /build/dune-geometry-2.6.0/build /build/dune-geometry-2.6.0/build/dune/geometry/test /build/dune-geometry-2.6.0/build/dune/geometry/test/CMakeFiles/test-constexpr-geometrytype.dir/DependInfo.cmake --color=
 make[5]: Entering directory '/build/dune-geometry-2.6.0/build'
 cd /build/dune-geometry-2.6.0/build && /usr/bin/cmake -E cmake_depends "Unix Makefiles" /build/dune-geometry-2.6.0 /build/dune-geometry-2.6.0/dune/geometry/test /build/dune-geometry-2.6.0/build /build/dune-geometry-2.6.0/build/dune/geometry/test /build/dune-geometry-2.6.0/build/dune/geometry/test/CMakeFiles/test-quadrature.dir/DependInfo.cmake --color=
-make[5]: Leaving directory '/build/dune-geometry-2.6.0/build'
-make -f dune/geometry/test/CMakeFiles/test-fromvertexcount.dir/build.make dune/geometry/test/CMakeFiles/test-fromvertexcount.dir/build
 make[5]: Entering directory '/build/dune-geometry-2.6.0/build'
 cd /build/dune-geometry-2.6.0/build && /usr/bin/cmake -E cmake_depends "Unix Makefiles" /build/dune-geometry-2.6.0 /build/dune-geometry-2.6.0/dune/geometry/test /build/dune-geometry-2.6.0/build /build/dune-geometry-2.6.0/build/dune/geometry/test /build/dune-geometry-2.6.0/build/dune/geometry/test/CMakeFiles/test-affinegeometry.dir/DependInfo.cmake --color=
-make -f dune/geometry/test/CMakeFiles/test-cornerstoragerefwrap.dir/build.make dune/geometry/test/CMakeFiles/test-cornerstoragerefwrap.dir/depend
-make[5]: Entering directory '/build/dune-geometry-2.6.0/build'
-Scanning dependencies of target test-constexpr-geometrytype
-make -f dune/geometry/test/CMakeFiles/test-referenceelements.dir/build.make dune/geometry/test/CMakeFiles/test-referenceelements.dir/depend
-make[5]: Leaving directory '/build/dune-geometry-2.6.0/build'
 make[5]: Entering directory '/build/dune-geometry-2.6.0/build'
 cd /build/dune-geometry-2.6.0/build && /usr/bin/cmake -E cmake_depends "Unix Makefiles" /build/dune-geometry-2.6.0 /build/dune-geometry-2.6.0/dune/geometry/test /build/dune-geometry-2.6.0/build /build/dune-geometry-2.6.0/build/dune/geometry/test /build/dune-geometry-2.6.0/build/dune/geometry/test/CMakeFiles/test-cornerstoragerefwrap.dir/DependInfo.cmake --color=
-make -f dune/geometry/test/CMakeFiles/test-constexpr-geometrytype.dir/build.make dune/geometry/test/CMakeFiles/test-constexpr-geometrytype.dir/build
 make[5]: Entering directory '/build/dune-geometry-2.6.0/build'
 cd /build/dune-geometry-2.6.0/build && /usr/bin/cmake -E cmake_depends "Unix Makefiles" /build/dune-geometry-2.6.0 /build/dune-geometry-2.6.0/dune/geometry/test /build/dune-geometry-2.6.0/build /build/dune-geometry-2.6.0/build/dune/geometry/test /build/dune-geometry-2.6.0/build/dune/geometry/test/CMakeFiles/test-referenceelements.dir/DependInfo.cmake --color=
-make[5]: Entering directory '/build/dune-geometry-2.6.0/build'
-make -f dune/geometry/test/CMakeFiles/test-multilineargeometry.dir/build.make dune/geometry/test/CMakeFiles/test-multilineargeometry.dir/depend
 [ 29%] Building CXX object dune/geometry/test/CMakeFiles/test-fromvertexcount.dir/test-fromvertexcount.cc.o
-cd /build/dune-geometry-2.6.0/build/dune/geometry/test && /usr/bin/c++  -DENABLE_MPI=1 -DENABLE_TBB=1 -DHAVE_CONFIG_H -DMPICH_SKIP_MPICXX -DMPIPP_H -DMPI_NO_CPPBIND -D_TBB_CPP0X -I/build/dune-geometry-2.6.0/build -I/build/dune-geometry-2.6.0 -I/usr/lib/x86_64-linux-gnu/openmpi/include/openmpi -I/usr/lib/x86_64-linux-gnu/openmpi/include  -std=c++17 -g -O2 -ffile-prefix-map=/build/dune-geometry-2.6.0=. -fstack-protector-strong -Wformat -Werror=format-security -Wdate-time -D_FORTIFY_SOURCE=2 -fPIE   -o CMakeFiles/test-fromvertexcount.dir/test-fromvertexcount.cc.o -c /build/dune-geometry-2.6.0/dune/geometry/test/test-fromvertexcount.cc
+make -f dune/geometry/test/CMakeFiles/test-refinement.dir/build.make dune/geometry/test/CMakeFiles/test-refinement.dir/depend
 make[5]: Entering directory '/build/dune-geometry-2.6.0/build'
 cd /build/dune-geometry-2.6.0/build && /usr/bin/cmake -E cmake_depends "Unix Makefiles" /build/dune-geometry-2.6.0 /build/dune-geometry-2.6.0/dune/geometry/test /build/dune-geometry-2.6.0/build /build/dune-geometry-2.6.0/build/dune/geometry/test /build/dune-geometry-2.6.0/build/dune/geometry/test/CMakeFiles/test-multilineargeometry.dir/DependInfo.cmake --color=
-make -f dune/geometry/test/CMakeFiles/test-refinement.dir/build.make dune/geometry/test/CMakeFiles/test-refinement.dir/depend
-make -f dune/geometry/test/CMakeFiles/test-nonetype.dir/build.make dune/geometry/test/CMakeFiles/test-nonetype.dir/depend
 make[5]: Entering directory '/build/dune-geometry-2.6.0/build'
 cd /build/dune-geometry-2.6.0/build && /usr/bin/cmake -E cmake_depends "Unix Makefiles" /build/dune-geometry-2.6.0 /build/dune-geometry-2.6.0/dune/geometry/test /build/dune-geometry-2.6.0/build /build/dune-geometry-2.6.0/build/dune/geometry/test /build/dune-geometry-2.6.0/build/dune/geometry/test/CMakeFiles/test-refinement.dir/DependInfo.cmake --color=
-Scanning dependencies of target test-cornerstoragerefwrap
-make[5]: Leaving directory '/build/dune-geometry-2.6.0/build'
+make -f dune/geometry/test/CMakeFiles/test-nonetype.dir/build.make dune/geometry/test/CMakeFiles/test-nonetype.dir/depend
 make[5]: Entering directory '/build/dune-geometry-2.6.0/build'
-make -f dune/geometry/test/CMakeFiles/test-cornerstoragerefwrap.dir/build.make dune/geometry/test/CMakeFiles/test-cornerstoragerefwrap.dir/build
 cd /build/dune-geometry-2.6.0/build && /usr/bin/cmake -E cmake_depends "Unix Makefiles" /build/dune-geometry-2.6.0 /build/dune-geometry-2.6.0/dune/geometry/test /build/dune-geometry-2.6.0/build /build/dune-geometry-2.6.0/build/dune/geometry/test /build/dune-geometry-2.6.0/build/dune/geometry/test/CMakeFiles/test-nonetype.dir/DependInfo.cmake --color=
+make -f dune/geometry/test/CMakeFiles/test-axisalignedcubegeometry.dir/build.make dune/geometry/test/CMakeFiles/test-axisalignedcubegeometry.dir/depend
+cd /build/dune-geometry-2.6.0/build/dune/geometry/test && /usr/bin/c++  -DENABLE_MPI=1 -DENABLE_TBB=1 -DHAVE_CONFIG_H -DMPICH_SKIP_MPICXX -DMPIPP_H -DMPI_NO_CPPBIND -D_TBB_CPP0X -I/build/dune-geometry-2.6.0/build -I/build/dune-geometry-2.6.0 -I/usr/lib/x86_64-linux-gnu/openmpi/include/openmpi -I/usr/lib/x86_64-linux-gnu/openmpi/include  -std=c++17 -g -O2 -ffile-prefix-map=/build/dune-geometry-2.6.0=. -fstack-protector-strong -Wformat -Werror=format-security -Wdate-time -D_FORTIFY_SOURCE=2 -fPIE   -o CMakeFiles/test-fromvertexcount.dir/test-fromvertexcount.cc.o -c /build/dune-geometry-2.6.0/dune/geometry/test/test-fromvertexcount.cc
+make[5]: Entering directory '/build/dune-geometry-2.6.0/build'
+cd /build/dune-geometry-2.6.0/build && /usr/bin/cmake -E cmake_depends "Unix Makefiles" /build/dune-geometry-2.6.0 /build/dune-geometry-2.6.0/dune/geometry/test /build/dune-geometry-2.6.0/build /build/dune-geometry-2.6.0/build/dune/geometry/test /build/dune-geometry-2.6.0/build/dune/geometry/test/CMakeFiles/test-axisalignedcubegeometry.dir/DependInfo.cmake --color=
+Scanning dependencies of target test-constexpr-geometrytype
+Scanning dependencies of target test-cornerstoragerefwrap
+make[5]: Leaving directory '/build/dune-geometry-2.6.0/build'
 Scanning dependencies of target test-referenceelements
 make[5]: Leaving directory '/build/dune-geometry-2.6.0/build'
+make -f dune/geometry/test/CMakeFiles/test-constexpr-geometrytype.dir/build.make dune/geometry/test/CMakeFiles/test-constexpr-geometrytype.dir/build
+make[5]: Leaving directory '/build/dune-geometry-2.6.0/build'
+Scanning dependencies of target test-nonetype
+make[5]: Entering directory '/build/dune-geometry-2.6.0/build'
+make -f dune/geometry/test/CMakeFiles/test-cornerstoragerefwrap.dir/build.make dune/geometry/test/CMakeFiles/test-cornerstoragerefwrap.dir/build
+Scanning dependencies of target test-multilineargeometry
 Scanning dependencies of target test-affinegeometry
 make[5]: Entering directory '/build/dune-geometry-2.6.0/build'
+make[5]: Leaving directory '/build/dune-geometry-2.6.0/build'
 make -f dune/geometry/test/CMakeFiles/test-referenceelements.dir/build.make dune/geometry/test/CMakeFiles/test-referenceelements.dir/build
 make[5]: Leaving directory '/build/dune-geometry-2.6.0/build'
-make[5]: Entering directory '/build/dune-geometry-2.6.0/build'
-make -f dune/geometry/test/CMakeFiles/test-affinegeometry.dir/build.make dune/geometry/test/CMakeFiles/test-affinegeometry.dir/build
-Scanning dependencies of target test-refinement
-Scanning dependencies of target test-quadrature
-make -f dune/geometry/test/CMakeFiles/test-axisalignedcubegeometry.dir/build.make dune/geometry/test/CMakeFiles/test-axisalignedcubegeometry.dir/depend
-[ 33%] Building CXX object dune/geometry/test/CMakeFiles/test-constexpr-geometrytype.dir/test-constexpr-geometrytype.cc.o
 make[5]: Leaving directory '/build/dune-geometry-2.6.0/build'
+Scanning dependencies of target test-quadrature
+Scanning dependencies of target test-refinement
 make[5]: Entering directory '/build/dune-geometry-2.6.0/build'
-cd /build/dune-geometry-2.6.0/build/dune/geometry/test && /usr/bin/c++  -DENABLE_MPI=1 -DENABLE_TBB=1 -DHAVE_CONFIG_H -DMPICH_SKIP_MPICXX -DMPIPP_H -DMPI_NO_CPPBIND -D_TBB_CPP0X -I/build/dune-geometry-2.6.0/build -I/build/dune-geometry-2.6.0 -I/usr/lib/x86_64-linux-gnu/openmpi/include/openmpi -I/usr/lib/x86_64-linux-gnu/openmpi/include  -std=c++17 -g -O2 -ffile-prefix-map=/build/dune-geometry-2.6.0=. -fstack-protector-strong -Wformat -Werror=format-security -Wdate-time -D_FORTIFY_SOURCE=2 -fPIE   -o CMakeFiles/test-constexpr-geometrytype.dir/test-constexpr-geometrytype.cc.o -c /build/dune-geometry-2.6.0/dune/geometry/test/test-constexpr-geometrytype.cc
-Scanning dependencies of target test-nonetype
 make[5]: Leaving directory '/build/dune-geometry-2.6.0/build'
+make -f dune/geometry/test/CMakeFiles/test-affinegeometry.dir/build.make dune/geometry/test/CMakeFiles/test-affinegeometry.dir/build
 make[5]: Entering directory '/build/dune-geometry-2.6.0/build'
-cd /build/dune-geometry-2.6.0/build && /usr/bin/cmake -E cmake_depends "Unix Makefiles" /build/dune-geometry-2.6.0 /build/dune-geometry-2.6.0/dune/geometry/test /build/dune-geometry-2.6.0/build /build/dune-geometry-2.6.0/build/dune/geometry/test /build/dune-geometry-2.6.0/build/dune/geometry/test/CMakeFiles/test-axisalignedcubegeometry.dir/DependInfo.cmake --color=
 make -f dune/geometry/test/CMakeFiles/test-quadrature.dir/build.make dune/geometry/test/CMakeFiles/test-quadrature.dir/build
-[ 37%] Building CXX object dune/geometry/test/CMakeFiles/test-cornerstoragerefwrap.dir/test-cornerstoragerefwrap.cc.o
 make[5]: Leaving directory '/build/dune-geometry-2.6.0/build'
-cd /build/dune-geometry-2.6.0/build/dune/geometry/test && /usr/bin/c++  -DENABLE_MPI=1 -DENABLE_TBB=1 -DHAVE_CONFIG_H -DMPICH_SKIP_MPICXX -DMPIPP_H -DMPI_NO_CPPBIND -D_TBB_CPP0X -I/build/dune-geometry-2.6.0/build -I/build/dune-geometry-2.6.0 -I/usr/lib/x86_64-linux-gnu/openmpi/include/openmpi -I/usr/lib/x86_64-linux-gnu/openmpi/include  -std=c++17 -g -O2 -ffile-prefix-map=/build/dune-geometry-2.6.0=. -fstack-protector-strong -Wformat -Werror=format-security -Wdate-time -D_FORTIFY_SOURCE=2 -fPIE   -o CMakeFiles/test-cornerstoragerefwrap.dir/test-cornerstoragerefwrap.cc.o -c /build/dune-geometry-2.6.0/dune/geometry/test/test-cornerstoragerefwrap.cc
+make -f dune/geometry/test/CMakeFiles/test-multilineargeometry.dir/build.make dune/geometry/test/CMakeFiles/test-multilineargeometry.dir/build
 make[5]: Entering directory '/build/dune-geometry-2.6.0/build'
-make -f dune/geometry/test/CMakeFiles/test-refinement.dir/build.make dune/geometry/test/CMakeFiles/test-refinement.dir/build
 make[5]: Entering directory '/build/dune-geometry-2.6.0/build'
+make -f dune/geometry/test/CMakeFiles/test-refinement.dir/build.make dune/geometry/test/CMakeFiles/test-refinement.dir/build
+[ 37%] Building CXX object dune/geometry/test/CMakeFiles/test-constexpr-geometrytype.dir/test-constexpr-geometrytype.cc.o
+[ 37%] Building CXX object dune/geometry/test/CMakeFiles/test-cornerstoragerefwrap.dir/test-cornerstoragerefwrap.cc.o
 make -f dune/geometry/test/CMakeFiles/test-nonetype.dir/build.make dune/geometry/test/CMakeFiles/test-nonetype.dir/build
+cd /build/dune-geometry-2.6.0/build/dune/geometry/test && /usr/bin/c++  -DENABLE_MPI=1 -DENABLE_TBB=1 -DHAVE_CONFIG_H -DMPICH_SKIP_MPICXX -DMPIPP_H -DMPI_NO_CPPBIND -D_TBB_CPP0X -I/build/dune-geometry-2.6.0/build -I/build/dune-geometry-2.6.0 -I/usr/lib/x86_64-linux-gnu/openmpi/include/openmpi -I/usr/lib/x86_64-linux-gnu/openmpi/include  -std=c++17 -g -O2 -ffile-prefix-map=/build/dune-geometry-2.6.0=. -fstack-protector-strong -Wformat -Werror=format-security -Wdate-time -D_FORTIFY_SOURCE=2 -fPIE   -o CMakeFiles/test-constexpr-geometrytype.dir/test-constexpr-geometrytype.cc.o -c /build/dune-geometry-2.6.0/dune/geometry/test/test-constexpr-geometrytype.cc
 make[5]: Entering directory '/build/dune-geometry-2.6.0/build'
-Scanning dependencies of target test-multilineargeometry
+cd /build/dune-geometry-2.6.0/build/dune/geometry/test && /usr/bin/c++  -DENABLE_MPI=1 -DENABLE_TBB=1 -DHAVE_CONFIG_H -DMPICH_SKIP_MPICXX -DMPIPP_H -DMPI_NO_CPPBIND -D_TBB_CPP0X -I/build/dune-geometry-2.6.0/build -I/build/dune-geometry-2.6.0 -I/usr/lib/x86_64-linux-gnu/openmpi/include/openmpi -I/usr/lib/x86_64-linux-gnu/openmpi/include  -std=c++17 -g -O2 -ffile-prefix-map=/build/dune-geometry-2.6.0=. -fstack-protector-strong -Wformat -Werror=format-security -Wdate-time -D_FORTIFY_SOURCE=2 -fPIE   -o CMakeFiles/test-cornerstoragerefwrap.dir/test-cornerstoragerefwrap.cc.o -c /build/dune-geometry-2.6.0/dune/geometry/test/test-cornerstoragerefwrap.cc
+make[5]: Entering directory '/build/dune-geometry-2.6.0/build'
+Scanning dependencies of target test-axisalignedcubegeometry
 [ 40%] Building CXX object dune/geometry/test/CMakeFiles/test-referenceelements.dir/test-referenceelements.cc.o
-make[5]: Leaving directory '/build/dune-geometry-2.6.0/build'
-make -f dune/geometry/test/CMakeFiles/test-multilineargeometry.dir/build.make dune/geometry/test/CMakeFiles/test-multilineargeometry.dir/build
-[ 44%] Building CXX object dune/geometry/test/CMakeFiles/test-affinegeometry.dir/test-affinegeometry.cc.o
 cd /build/dune-geometry-2.6.0/build/dune/geometry/test && /usr/bin/c++  -DENABLE_MPI=1 -DENABLE_TBB=1 -DHAVE_CONFIG_H -DMPICH_SKIP_MPICXX -DMPIPP_H -DMPI_NO_CPPBIND -D_TBB_CPP0X -I/build/dune-geometry-2.6.0/build -I/build/dune-geometry-2.6.0 -I/usr/lib/x86_64-linux-gnu/openmpi/include/openmpi -I/usr/lib/x86_64-linux-gnu/openmpi/include  -std=c++17 -g -O2 -ffile-prefix-map=/build/dune-geometry-2.6.0=. -fstack-protector-strong -Wformat -Werror=format-security -Wdate-time -D_FORTIFY_SOURCE=2 -fPIE   -o CMakeFiles/test-referenceelements.dir/test-referenceelements.cc.o -c /build/dune-geometry-2.6.0/dune/geometry/test/test-referenceelements.cc
-cd /build/dune-geometry-2.6.0/build/dune/geometry/test && /usr/bin/c++  -DENABLE_MPI=1 -DENABLE_TBB=1 -DHAVE_CONFIG_H -DMPICH_SKIP_MPICXX -DMPIPP_H -DMPI_NO_CPPBIND -D_TBB_CPP0X -I/build/dune-geometry-2.6.0/build -I/build/dune-geometry-2.6.0 -I/usr/lib/x86_64-linux-gnu/openmpi/include/openmpi -I/usr/lib/x86_64-linux-gnu/openmpi/include  -std=c++17 -g -O2 -ffile-prefix-map=/build/dune-geometry-2.6.0=. -fstack-protector-strong -Wformat -Werror=format-security -Wdate-time -D_FORTIFY_SOURCE=2 -fPIE   -o CMakeFiles/test-affinegeometry.dir/test-affinegeometry.cc.o -c /build/dune-geometry-2.6.0/dune/geometry/test/test-affinegeometry.cc
-Scanning dependencies of target test-axisalignedcubegeometry
-make[5]: Entering directory '/build/dune-geometry-2.6.0/build'
 make[5]: Leaving directory '/build/dune-geometry-2.6.0/build'
 make -f dune/geometry/test/CMakeFiles/test-axisalignedcubegeometry.dir/build.make dune/geometry/test/CMakeFiles/test-axisalignedcubegeometry.dir/build
-make[5]: Entering directory '/build/dune-geometry-2.6.0/build'
-[ 48%] Building CXX object dune/geometry/test/CMakeFiles/test-quadrature.dir/test-quadrature.cc.o
-cd /build/dune-geometry-2.6.0/build/dune/geometry/test && /usr/bin/c++  -DENABLE_MPI=1 -DENABLE_TBB=1 -DHAVE_CONFIG_H -DMPICH_SKIP_MPICXX -DMPIPP_H -DMPI_NO_CPPBIND -D_TBB_CPP0X -I/build/dune-geometry-2.6.0/build -I/build/dune-geometry-2.6.0 -I/usr/lib/x86_64-linux-gnu/openmpi/include/openmpi -I/usr/lib/x86_64-linux-gnu/openmpi/include  -std=c++17 -g -O2 -ffile-prefix-map=/build/dune-geometry-2.6.0=. -fstack-protector-strong -Wformat -Werror=format-security -Wdate-time -D_FORTIFY_SOURCE=2 -fPIE   -o CMakeFiles/test-quadrature.dir/test-quadrature.cc.o -c /build/dune-geometry-2.6.0/dune/geometry/test/test-quadrature.cc
-[ 51%] Building CXX object dune/geometry/test/CMakeFiles/test-refinement.dir/test-refinement.cc.o
-[ 55%] Building CXX object dune/geometry/test/CMakeFiles/test-multilineargeometry.dir/test-multilineargeometry.cc.o
-cd /build/dune-geometry-2.6.0/build/dune/geometry/test && /usr/bin/c++  -DENABLE_MPI=1 -DENABLE_TBB=1 -DHAVE_CONFIG_H -DMPICH_SKIP_MPICXX -DMPIPP_H -DMPI_NO_CPPBIND -D_TBB_CPP0X -I/build/dune-geometry-2.6.0/build -I/build/dune-geometry-2.6.0 -I/usr/lib/x86_64-linux-gnu/openmpi/include/openmpi -I/usr/lib/x86_64-linux-gnu/openmpi/include  -std=c++17 -g -O2 -ffile-prefix-map=/build/dune-geometry-2.6.0=. -fstack-protector-strong -Wformat -Werror=format-security -Wdate-time -D_FORTIFY_SOURCE=2 -fPIE   -o CMakeFiles/test-refinement.dir/test-refinement.cc.o -c /build/dune-geometry-2.6.0/dune/geometry/test/test-refinement.cc
+[ 44%] Building CXX object dune/geometry/test/CMakeFiles/test-affinegeometry.dir/test-affinegeometry.cc.o
+[ 48%] Building CXX object dune/geometry/test/CMakeFiles/test-multilineargeometry.dir/test-multilineargeometry.cc.o
+cd /build/dune-geometry-2.6.0/build/dune/geometry/test && /usr/bin/c++  -DENABLE_MPI=1 -DENABLE_TBB=1 -DHAVE_CONFIG_H -DMPICH_SKIP_MPICXX -DMPIPP_H -DMPI_NO_CPPBIND -D_TBB_CPP0X -I/build/dune-geometry-2.6.0/build -I/build/dune-geometry-2.6.0 -I/usr/lib/x86_64-linux-gnu/openmpi/include/openmpi -I/usr/lib/x86_64-linux-gnu/openmpi/include  -std=c++17 -g -O2 -ffile-prefix-map=/build/dune-geometry-2.6.0=. -fstack-protector-strong -Wformat -Werror=format-security -Wdate-time -D_FORTIFY_SOURCE=2 -fPIE   -o CMakeFiles/test-affinegeometry.dir/test-affinegeometry.cc.o -c /build/dune-geometry-2.6.0/dune/geometry/test/test-affinegeometry.cc
 cd /build/dune-geometry-2.6.0/build/dune/geometry/test && /usr/bin/c++  -DENABLE_MPI=1 -DENABLE_TBB=1 -DHAVE_CONFIG_H -DMPICH_SKIP_MPICXX -DMPIPP_H -DMPI_NO_CPPBIND -D_TBB_CPP0X -I/build/dune-geometry-2.6.0/build -I/build/dune-geometry-2.6.0 -I/usr/lib/x86_64-linux-gnu/openmpi/include/openmpi -I/usr/lib/x86_64-linux-gnu/openmpi/include  -std=c++17 -g -O2 -ffile-prefix-map=/build/dune-geometry-2.6.0=. -fstack-protector-strong -Wformat -Werror=format-security -Wdate-time -D_FORTIFY_SOURCE=2 -fPIE   -o CMakeFiles/test-multilineargeometry.dir/test-multilineargeometry.cc.o -c /build/dune-geometry-2.6.0/dune/geometry/test/test-multilineargeometry.cc
-[ 59%] Building CXX object dune/geometry/test/CMakeFiles/test-nonetype.dir/test-nonetype.cc.o
+[ 51%] Building CXX object dune/geometry/test/CMakeFiles/test-quadrature.dir/test-quadrature.cc.o
+cd /build/dune-geometry-2.6.0/build/dune/geometry/test && /usr/bin/c++  -DENABLE_MPI=1 -DENABLE_TBB=1 -DHAVE_CONFIG_H -DMPICH_SKIP_MPICXX -DMPIPP_H -DMPI_NO_CPPBIND -D_TBB_CPP0X -I/build/dune-geometry-2.6.0/build -I/build/dune-geometry-2.6.0 -I/usr/lib/x86_64-linux-gnu/openmpi/include/openmpi -I/usr/lib/x86_64-linux-gnu/openmpi/include  -std=c++17 -g -O2 -ffile-prefix-map=/build/dune-geometry-2.6.0=. -fstack-protector-strong -Wformat -Werror=format-security -Wdate-time -D_FORTIFY_SOURCE=2 -fPIE   -o CMakeFiles/test-quadrature.dir/test-quadrature.cc.o -c /build/dune-geometry-2.6.0/dune/geometry/test/test-quadrature.cc
+make[5]: Entering directory '/build/dune-geometry-2.6.0/build'
+[ 55%] Building CXX object dune/geometry/test/CMakeFiles/test-nonetype.dir/test-nonetype.cc.o
 cd /build/dune-geometry-2.6.0/build/dune/geometry/test && /usr/bin/c++  -DENABLE_MPI=1 -DENABLE_TBB=1 -DHAVE_CONFIG_H -DMPICH_SKIP_MPICXX -DMPIPP_H -DMPI_NO_CPPBIND -D_TBB_CPP0X -I/build/dune-geometry-2.6.0/build -I/build/dune-geometry-2.6.0 -I/usr/lib/x86_64-linux-gnu/openmpi/include/openmpi -I/usr/lib/x86_64-linux-gnu/openmpi/include  -std=c++17 -g -O2 -ffile-prefix-map=/build/dune-geometry-2.6.0=. -fstack-protector-strong -Wformat -Werror=format-security -Wdate-time -D_FORTIFY_SOURCE=2 -fPIE   -o CMakeFiles/test-nonetype.dir/test-nonetype.cc.o -c /build/dune-geometry-2.6.0/dune/geometry/test/test-nonetype.cc
+[ 59%] Building CXX object dune/geometry/test/CMakeFiles/test-refinement.dir/test-refinement.cc.o
+cd /build/dune-geometry-2.6.0/build/dune/geometry/test && /usr/bin/c++  -DENABLE_MPI=1 -DENABLE_TBB=1 -DHAVE_CONFIG_H -DMPICH_SKIP_MPICXX -DMPIPP_H -DMPI_NO_CPPBIND -D_TBB_CPP0X -I/build/dune-geometry-2.6.0/build -I/build/dune-geometry-2.6.0 -I/usr/lib/x86_64-linux-gnu/openmpi/include/openmpi -I/usr/lib/x86_64-linux-gnu/openmpi/include  -std=c++17 -g -O2 -ffile-prefix-map=/build/dune-geometry-2.6.0=. -fstack-protector-strong -Wformat -Werror=format-security -Wdate-time -D_FORTIFY_SOURCE=2 -fPIE   -o CMakeFiles/test-refinement.dir/test-refinement.cc.o -c /build/dune-geometry-2.6.0/dune/geometry/test/test-refinement.cc
 [ 62%] Building CXX object dune/geometry/test/CMakeFiles/test-axisalignedcubegeometry.dir/test-axisalignedcubegeometry.cc.o
 cd /build/dune-geometry-2.6.0/build/dune/geometry/test && /usr/bin/c++  -DENABLE_MPI=1 -DENABLE_TBB=1 -DHAVE_CONFIG_H -DMPICH_SKIP_MPICXX -DMPIPP_H -DMPI_NO_CPPBIND -D_TBB_CPP0X -I/build/dune-geometry-2.6.0/build -I/build/dune-geometry-2.6.0 -I/usr/lib/x86_64-linux-gnu/openmpi/include/openmpi -I/usr/lib/x86_64-linux-gnu/openmpi/include  -std=c++17 -g -O2 -ffile-prefix-map=/build/dune-geometry-2.6.0=. -fstack-protector-strong -Wformat -Werror=format-security -Wdate-time -D_FORTIFY_SOURCE=2 -fPIE   -o CMakeFiles/test-axisalignedcubegeometry.dir/test-axisalignedcubegeometry.cc.o -c /build/dune-geometry-2.6.0/dune/geometry/test/test-axisalignedcubegeometry.cc
 /build/dune-geometry-2.6.0/dune/geometry/test/test-nonetype.cc: In function 'int main(int, char**)':
@@ -2033,26 +2068,26 @@
 /usr/bin/c++  -std=c++17 -g -O2 -ffile-prefix-map=/build/dune-geometry-2.6.0=. -fstack-protector-strong -Wformat -Werror=format-security -Wdate-time -D_FORTIFY_SOURCE=2  -Wl,-z,relro -pthread -rdynamic CMakeFiles/test-referenceelements.dir/test-referenceelements.cc.o  -o test-referenceelements -Wl,-rpath,/usr/lib/x86_64-linux-gnu/openmpi/lib:/build/dune-geometry-2.6.0/build/lib -pthread /usr/lib/x86_64-linux-gnu/openmpi/lib/libmpi.so ../../../lib/libdunegeometry.so.2.6-git /usr/lib/x86_64-linux-gnu/libdunecommon.so.2.6-git 
 make[5]: Leaving directory '/build/dune-geometry-2.6.0/build'
 [ 81%] Built target test-referenceelements
-[ 85%] Linking CXX executable test-quadrature
-cd /build/dune-geometry-2.6.0/build/dune/geometry/test && /usr/bin/cmake -E cmake_link_script CMakeFiles/test-quadrature.dir/link.txt --verbose=1
-/usr/bin/c++  -std=c++17 -g -O2 -ffile-prefix-map=/build/dune-geometry-2.6.0=. -fstack-protector-strong -Wformat -Werror=format-security -Wdate-time -D_FORTIFY_SOURCE=2  -Wl,-z,relro -pthread -rdynamic CMakeFiles/test-quadrature.dir/test-quadrature.cc.o  -o test-quadrature -Wl,-rpath,/usr/lib/x86_64-linux-gnu/openmpi/lib:/build/dune-geometry-2.6.0/build/lib -pthread /usr/lib/x86_64-linux-gnu/openmpi/lib/libmpi.so ../../../lib/libdunegeometry.so.2.6-git /usr/lib/x86_64-linux-gnu/libdunecommon.so.2.6-git 
-make[5]: Leaving directory '/build/dune-geometry-2.6.0/build'
-[ 85%] Built target test-quadrature
-[ 88%] Linking CXX executable test-axisalignedcubegeometry
+[ 85%] Linking CXX executable test-axisalignedcubegeometry
 cd /build/dune-geometry-2.6.0/build/dune/geometry/test && /usr/bin/cmake -E cmake_link_script CMakeFiles/test-axisalignedcubegeometry.dir/link.txt --verbose=1
 /usr/bin/c++  -std=c++17 -g -O2 -ffile-prefix-map=/build/dune-geometry-2.6.0=. -fstack-protector-strong -Wformat -Werror=format-security -Wdate-time -D_FORTIFY_SOURCE=2  -Wl,-z,relro -pthread -rdynamic CMakeFiles/test-axisalignedcubegeometry.dir/test-axisalignedcubegeometry.cc.o  -o test-axisalignedcubegeometry -Wl,-rpath,/usr/lib/x86_64-linux-gnu/openmpi/lib:/build/dune-geometry-2.6.0/build/lib -pthread /usr/lib/x86_64-linux-gnu/openmpi/lib/libmpi.so ../../../lib/libdunegeometry.so.2.6-git /usr/lib/x86_64-linux-gnu/libdunecommon.so.2.6-git 
 make[5]: Leaving directory '/build/dune-geometry-2.6.0/build'
-[ 88%] Built target test-axisalignedcubegeometry
-[ 92%] Linking CXX executable test-affinegeometry
-cd /build/dune-geometry-2.6.0/build/dune/geometry/test && /usr/bin/cmake -E cmake_link_script CMakeFiles/test-affinegeometry.dir/link.txt --verbose=1
-/usr/bin/c++  -std=c++17 -g -O2 -ffile-prefix-map=/build/dune-geometry-2.6.0=. -fstack-protector-strong -Wformat -Werror=format-security -Wdate-time -D_FORTIFY_SOURCE=2  -Wl,-z,relro -pthread -rdynamic CMakeFiles/test-affinegeometry.dir/test-affinegeometry.cc.o  -o test-affinegeometry -Wl,-rpath,/usr/lib/x86_64-linux-gnu/openmpi/lib:/build/dune-geometry-2.6.0/build/lib -pthread /usr/lib/x86_64-linux-gnu/openmpi/lib/libmpi.so ../../../lib/libdunegeometry.so.2.6-git /usr/lib/x86_64-linux-gnu/libdunecommon.so.2.6-git 
+[ 85%] Built target test-axisalignedcubegeometry
+[ 88%] Linking CXX executable test-quadrature
+cd /build/dune-geometry-2.6.0/build/dune/geometry/test && /usr/bin/cmake -E cmake_link_script CMakeFiles/test-quadrature.dir/link.txt --verbose=1
+/usr/bin/c++  -std=c++17 -g -O2 -ffile-prefix-map=/build/dune-geometry-2.6.0=. -fstack-protector-strong -Wformat -Werror=format-security -Wdate-time -D_FORTIFY_SOURCE=2  -Wl,-z,relro -pthread -rdynamic CMakeFiles/test-quadrature.dir/test-quadrature.cc.o  -o test-quadrature -Wl,-rpath,/usr/lib/x86_64-linux-gnu/openmpi/lib:/build/dune-geometry-2.6.0/build/lib -pthread /usr/lib/x86_64-linux-gnu/openmpi/lib/libmpi.so ../../../lib/libdunegeometry.so.2.6-git /usr/lib/x86_64-linux-gnu/libdunecommon.so.2.6-git 
 make[5]: Leaving directory '/build/dune-geometry-2.6.0/build'
-[ 92%] Built target test-affinegeometry
-[ 96%] Linking CXX executable test-refinement
+[ 88%] Built target test-quadrature
+[ 92%] Linking CXX executable test-refinement
 cd /build/dune-geometry-2.6.0/build/dune/geometry/test && /usr/bin/cmake -E cmake_link_script CMakeFiles/test-refinement.dir/link.txt --verbose=1
 /usr/bin/c++  -std=c++17 -g -O2 -ffile-prefix-map=/build/dune-geometry-2.6.0=. -fstack-protector-strong -Wformat -Werror=format-security -Wdate-time -D_FORTIFY_SOURCE=2  -Wl,-z,relro -pthread -rdynamic CMakeFiles/test-refinement.dir/test-refinement.cc.o  -o test-refinement -Wl,-rpath,/usr/lib/x86_64-linux-gnu/openmpi/lib:/build/dune-geometry-2.6.0/build/lib -pthread /usr/lib/x86_64-linux-gnu/openmpi/lib/libmpi.so ../../../lib/libdunegeometry.so.2.6-git /usr/lib/x86_64-linux-gnu/libdunecommon.so.2.6-git 
 make[5]: Leaving directory '/build/dune-geometry-2.6.0/build'
-[ 96%] Built target test-refinement
+[ 92%] Built target test-refinement
+[ 96%] Linking CXX executable test-affinegeometry
+cd /build/dune-geometry-2.6.0/build/dune/geometry/test && /usr/bin/cmake -E cmake_link_script CMakeFiles/test-affinegeometry.dir/link.txt --verbose=1
+/usr/bin/c++  -std=c++17 -g -O2 -ffile-prefix-map=/build/dune-geometry-2.6.0=. -fstack-protector-strong -Wformat -Werror=format-security -Wdate-time -D_FORTIFY_SOURCE=2  -Wl,-z,relro -pthread -rdynamic CMakeFiles/test-affinegeometry.dir/test-affinegeometry.cc.o  -o test-affinegeometry -Wl,-rpath,/usr/lib/x86_64-linux-gnu/openmpi/lib:/build/dune-geometry-2.6.0/build/lib -pthread /usr/lib/x86_64-linux-gnu/openmpi/lib/libmpi.so ../../../lib/libdunegeometry.so.2.6-git /usr/lib/x86_64-linux-gnu/libdunecommon.so.2.6-git 
+make[5]: Leaving directory '/build/dune-geometry-2.6.0/build'
+[ 96%] Built target test-affinegeometry
 [100%] Linking CXX executable test-multilineargeometry
 cd /build/dune-geometry-2.6.0/build/dune/geometry/test && /usr/bin/cmake -E cmake_link_script CMakeFiles/test-multilineargeometry.dir/link.txt --verbose=1
 /usr/bin/c++  -std=c++17 -g -O2 -ffile-prefix-map=/build/dune-geometry-2.6.0=. -fstack-protector-strong -Wformat -Werror=format-security -Wdate-time -D_FORTIFY_SOURCE=2  -Wl,-z,relro -pthread -rdynamic CMakeFiles/test-multilineargeometry.dir/test-multilineargeometry.cc.o  -o test-multilineargeometry -Wl,-rpath,/usr/lib/x86_64-linux-gnu/openmpi/lib:/build/dune-geometry-2.6.0/build/lib -pthread /usr/lib/x86_64-linux-gnu/openmpi/lib/libmpi.so ../../../lib/libdunegeometry.so.2.6-git /usr/lib/x86_64-linux-gnu/libdunecommon.so.2.6-git 
@@ -2073,39 +2108,39 @@
 make[3]: Leaving directory '/build/dune-geometry-2.6.0/build'
 make[2]: Leaving directory '/build/dune-geometry-2.6.0/build'
 cd build; PATH=/build/dune-geometry-2.6.0/debian/tmp-test:$PATH /usr/bin/dune-ctest
-   Site: ionos5-amd64
+   Site: i-capture-the-hostname
    Build name: Linux-c++
-Create new tag: 20230104-0503 - Experimental
+Create new tag: 20211201-2244 - Experimental
 Test project /build/dune-geometry-2.6.0/build
       Start  1: test-affinegeometry
- 1/10 Test  #1: test-affinegeometry ..............   Passed    0.05 sec
+ 1/10 Test  #1: test-affinegeometry ..............   Passed    0.01 sec
       Start  2: test-axisalignedcubegeometry
- 2/10 Test  #2: test-axisalignedcubegeometry .....   Passed    0.03 sec
+ 2/10 Test  #2: test-axisalignedcubegeometry .....   Passed    0.01 sec
       Start  3: test-cornerstoragerefwrap
- 3/10 Test  #3: test-cornerstoragerefwrap ........   Passed    0.03 sec
+ 3/10 Test  #3: test-cornerstoragerefwrap ........   Passed    0.01 sec
       Start  4: test-fromvertexcount
- 4/10 Test  #4: test-fromvertexcount .............   Passed    0.02 sec
+ 4/10 Test  #4: test-fromvertexcount .............   Passed    0.01 sec
       Start  5: test-referenceelements
- 5/10 Test  #5: test-referenceelements ...........   Passed    0.02 sec
+ 5/10 Test  #5: test-referenceelements ...........   Passed    0.01 sec
       Start  6: test-quadrature
- 6/10 Test  #6: test-quadrature ..................   Passed   10.87 sec
+ 6/10 Test  #6: test-quadrature ..................   Passed    6.24 sec
       Start  7: test-multilineargeometry
- 7/10 Test  #7: test-multilineargeometry .........   Passed    0.04 sec
+ 7/10 Test  #7: test-multilineargeometry .........   Passed    0.02 sec
       Start  8: test-nonetype
- 8/10 Test  #8: test-nonetype ....................   Passed    0.02 sec
+ 8/10 Test  #8: test-nonetype ....................   Passed    0.01 sec
       Start  9: test-refinement
- 9/10 Test  #9: test-refinement ..................   Passed    0.07 sec
+ 9/10 Test  #9: test-refinement ..................   Passed    0.02 sec
       Start 10: test-constexpr-geometrytype
-10/10 Test #10: test-constexpr-geometrytype ......   Passed    0.02 sec
+10/10 Test #10: test-constexpr-geometrytype ......   Passed    0.01 sec
 
 100% tests passed, 0 tests failed out of 10
 
-Total Test time (real) =  11.19 sec
+Total Test time (real) =   6.34 sec
 make[1]: Leaving directory '/build/dune-geometry-2.6.0'
    dh_testroot -O--parallel -O--builddirectory=build
    dh_prep -O--parallel -O--builddirectory=build
    dh_auto_install -O--parallel -O--builddirectory=build
-	cd build && make -j16 install DESTDIR=/build/dune-geometry-2.6.0/debian/tmp AM_UPDATE_INFO_DIR=no
+	cd build && make -j15 install DESTDIR=/build/dune-geometry-2.6.0/debian/tmp AM_UPDATE_INFO_DIR=no
 make[1]: Entering directory '/build/dune-geometry-2.6.0/build'
 /usr/bin/cmake -S/build/dune-geometry-2.6.0 -B/build/dune-geometry-2.6.0/build --check-build-system CMakeFiles/Makefile.cmake 0
 /usr/bin/cmake -E cmake_progress_start /build/dune-geometry-2.6.0/build/CMakeFiles /build/dune-geometry-2.6.0/build/CMakeFiles/progress.marks
@@ -2790,8 +2825,8 @@
 -- Installing: /build/dune-geometry-2.6.0/debian/tmp/usr/share/doc/dune-geometry/doxygen/tabs.css
 -- Installed doxygen into /usr/share/doc/dune-geometry/doxygen
 make[2]: Entering directory '/build/dune-geometry-2.6.0/build'
-make[2]: warning: jobserver unavailable: using -j1.  Add '+' to parent make rule.
 /usr/bin/cmake -S/build/dune-geometry-2.6.0 -B/build/dune-geometry-2.6.0/build --check-build-system CMakeFiles/Makefile.cmake 0
+make[2]: warning: jobserver unavailable: using -j1.  Add '+' to parent make rule.
 /usr/bin/make -f CMakeFiles/Makefile2 install_refinement.pdf
 make[3]: Entering directory '/build/dune-geometry-2.6.0/build'
 /usr/bin/cmake -S/build/dune-geometry-2.6.0 -B/build/dune-geometry-2.6.0/build --check-build-system CMakeFiles/Makefile.cmake 0
@@ -2808,17 +2843,17 @@
 [ 10%] Generating /build/dune-geometry-2.6.0/build/doc/refinement/referencetokuhn0.svg from /build/dune-geometry-2.6.0/doc/refinement/referencetokuhn0.png
 cd /build/dune-geometry-2.6.0/build/doc/refinement && /usr/bin/inkscape --export-dpi=180 -e referencetokuhn0.png /build/dune-geometry-2.6.0/doc/refinement/referencetokuhn0.svg
 
-** (inkscape:1816333): WARNING **: 17:04:36.012: Unable to create profile directory (Permission denied) (13)
-** Message: 17:04:36.040: Cannot create profile directory /nonexistent/first-build/.config/inkscape.
-** Message: 17:04:36.040: Inkscape will run with default settings, and new settings will not be saved. 
+** (inkscape:502832): WARNING **: 12:45:36.148: Unable to create profile directory (Permission denied) (13)
+** Message: 12:45:36.156: Cannot create profile directory /nonexistent/second-build/.config/inkscape.
+** Message: 12:45:36.157: Inkscape will run with default settings, and new settings will not be saved. 
 Failed to get connection
-** (inkscape:1816333): CRITICAL **: 17:04:36.206: dbus_g_proxy_new_for_name: assertion 'connection != NULL' failed
+** (inkscape:502832): CRITICAL **: 12:45:36.162: dbus_g_proxy_new_for_name: assertion 'connection != NULL' failed
 
-** (inkscape:1816333): CRITICAL **: 17:04:36.206: dbus_g_proxy_call: assertion 'DBUS_IS_G_PROXY (proxy)' failed
+** (inkscape:502832): CRITICAL **: 12:45:36.162: dbus_g_proxy_call: assertion 'DBUS_IS_G_PROXY (proxy)' failed
 
-** (inkscape:1816333): CRITICAL **: 17:04:36.206: dbus_g_connection_register_g_object: assertion 'connection != NULL' failed
+** (inkscape:502832): CRITICAL **: 12:45:36.162: dbus_g_connection_register_g_object: assertion 'connection != NULL' failed
 
-** (inkscape:1816333): WARNING **: 17:04:37.361: Could not create extension error log file '/nonexistent/first-build/.config/inkscape/extension-errors.log'
+** (inkscape:502832): WARNING **: 12:45:36.514: Could not create extension error log file '/nonexistent/second-build/.config/inkscape/extension-errors.log'
 DPI: 180
 Background RRGGBBAA: ffffff00
 Area 0:0:500:720 exported to 937 x 1350 pixels (180 dpi)
@@ -2835,17 +2870,17 @@
 [ 20%] Generating /build/dune-geometry-2.6.0/build/doc/refinement/kuhntriangulation.svg from /build/dune-geometry-2.6.0/doc/refinement/kuhntriangulation.png
 cd /build/dune-geometry-2.6.0/build/doc/refinement && /usr/bin/inkscape --export-dpi=180 -e kuhntriangulation.png /build/dune-geometry-2.6.0/doc/refinement/kuhntriangulation.svg
 
-** (inkscape:1817444): WARNING **: 17:04:39.300: Unable to create profile directory (Permission denied) (13)
-** Message: 17:04:39.311: Cannot create profile directory /nonexistent/first-build/.config/inkscape.
-** Message: 17:04:39.311: Inkscape will run with default settings, and new settings will not be saved. 
+** (inkscape:503001): WARNING **: 12:45:37.097: Unable to create profile directory (Permission denied) (13)
+** Message: 12:45:37.106: Cannot create profile directory /nonexistent/second-build/.config/inkscape.
+** Message: 12:45:37.106: Inkscape will run with default settings, and new settings will not be saved. 
 Failed to get connection
-** (inkscape:1817444): CRITICAL **: 17:04:39.405: dbus_g_proxy_new_for_name: assertion 'connection != NULL' failed
+** (inkscape:503001): CRITICAL **: 12:45:37.152: dbus_g_proxy_new_for_name: assertion 'connection != NULL' failed
 
-** (inkscape:1817444): CRITICAL **: 17:04:39.405: dbus_g_proxy_call: assertion 'DBUS_IS_G_PROXY (proxy)' failed
+** (inkscape:503001): CRITICAL **: 12:45:37.152: dbus_g_proxy_call: assertion 'DBUS_IS_G_PROXY (proxy)' failed
 
-** (inkscape:1817444): CRITICAL **: 17:04:39.405: dbus_g_connection_register_g_object: assertion 'connection != NULL' failed
+** (inkscape:503001): CRITICAL **: 12:45:37.152: dbus_g_connection_register_g_object: assertion 'connection != NULL' failed
 
-** (inkscape:1817444): WARNING **: 17:04:40.188: Could not create extension error log file '/nonexistent/first-build/.config/inkscape/extension-errors.log'
+** (inkscape:503001): WARNING **: 12:45:37.472: Could not create extension error log file '/nonexistent/second-build/.config/inkscape/extension-errors.log'
 DPI: 180
 Background RRGGBBAA: ffffffff
 Area 0:0:191:221.45 exported to 358 x 415 pixels (180 dpi)
@@ -2862,17 +2897,17 @@
 [ 30%] Generating /build/dune-geometry-2.6.0/build/doc/refinement/simplexvertexindex.svg from /build/dune-geometry-2.6.0/doc/refinement/simplexvertexindex.png
 cd /build/dune-geometry-2.6.0/build/doc/refinement && /usr/bin/inkscape --export-dpi=180 -e simplexvertexindex.png /build/dune-geometry-2.6.0/doc/refinement/simplexvertexindex.svg
 
-** (inkscape:1817733): WARNING **: 17:04:41.056: Unable to create profile directory (Permission denied) (13)
-** Message: 17:04:41.067: Cannot create profile directory /nonexistent/first-build/.config/inkscape.
-** Message: 17:04:41.067: Inkscape will run with default settings, and new settings will not be saved. 
+** (inkscape:503111): WARNING **: 12:45:37.877: Unable to create profile directory (Permission denied) (13)
+** Message: 12:45:37.886: Cannot create profile directory /nonexistent/second-build/.config/inkscape.
+** Message: 12:45:37.886: Inkscape will run with default settings, and new settings will not be saved. 
 Failed to get connection
-** (inkscape:1817733): CRITICAL **: 17:04:41.121: dbus_g_proxy_new_for_name: assertion 'connection != NULL' failed
+** (inkscape:503111): CRITICAL **: 12:45:37.893: dbus_g_proxy_new_for_name: assertion 'connection != NULL' failed
 
-** (inkscape:1817733): CRITICAL **: 17:04:41.121: dbus_g_proxy_call: assertion 'DBUS_IS_G_PROXY (proxy)' failed
+** (inkscape:503111): CRITICAL **: 12:45:37.893: dbus_g_proxy_call: assertion 'DBUS_IS_G_PROXY (proxy)' failed
 
-** (inkscape:1817733): CRITICAL **: 17:04:41.121: dbus_g_connection_register_g_object: assertion 'connection != NULL' failed
+** (inkscape:503111): CRITICAL **: 12:45:37.893: dbus_g_connection_register_g_object: assertion 'connection != NULL' failed
 
-** (inkscape:1817733): WARNING **: 17:04:41.962: Could not create extension error log file '/nonexistent/first-build/.config/inkscape/extension-errors.log'
+** (inkscape:503111): WARNING **: 12:45:38.347: Could not create extension error log file '/nonexistent/second-build/.config/inkscape/extension-errors.log'
 DPI: 180
 Background RRGGBBAA: ffffffff
 Area 0:0:300:300 exported to 562 x 562 pixels (180 dpi)
@@ -2891,15 +2926,15 @@
 [ 50%] Converting /build/dune-geometry-2.6.0/build/doc/refinement/simplexvertexindex.png to /build/dune-geometry-2.6.0/build/doc/refinement/simplexvertexindex.eps
 cd /build/dune-geometry-2.6.0/build/doc/refinement && /usr/bin/convert /build/dune-geometry-2.6.0/build/doc/refinement/simplexvertexindex.png EPS:simplexvertexindex.eps
 convert: attempt to perform an operation not allowed by the security policy `EPS' @ error/constitute.c/IsCoderAuthorized/408.
-make[5]: Leaving directory '/build/dune-geometry-2.6.0/build'
 make[5]: *** [doc/refinement/CMakeFiles/refinement_ps.dir/build.make:78: doc/refinement/simplexvertexindex.eps] Error 1
 make[5]: *** Deleting file 'doc/refinement/simplexvertexindex.eps'
-make[4]: *** [CMakeFiles/Makefile2:2048: doc/refinement/CMakeFiles/refinement_ps.dir/all] Error 2
+make[5]: Leaving directory '/build/dune-geometry-2.6.0/build'
 make[4]: Leaving directory '/build/dune-geometry-2.6.0/build'
-make[3]: Leaving directory '/build/dune-geometry-2.6.0/build'
+make[4]: *** [CMakeFiles/Makefile2:2048: doc/refinement/CMakeFiles/refinement_ps.dir/all] Error 2
 make[3]: *** [CMakeFiles/Makefile2:2281: doc/refinement/CMakeFiles/install_refinement.pdf.dir/rule] Error 2
-make[2]: Leaving directory '/build/dune-geometry-2.6.0/build'
+make[3]: Leaving directory '/build/dune-geometry-2.6.0/build'
 make[2]: *** [Makefile:993: install_refinement.pdf] Error 2
+make[2]: Leaving directory '/build/dune-geometry-2.6.0/build'
 -- Installing: /build/dune-geometry-2.6.0/debian/tmp/usr/lib/x86_64-linux-gnu/libdunegeometry.so.2.6-git
 -- Installing: /build/dune-geometry-2.6.0/debian/tmp/usr/lib/x86_64-linux-gnu/libdunegeometry.so
 -- Installing: /build/dune-geometry-2.6.0/debian/tmp/usr/lib/x86_64-linux-gnu/cmake/dune-geometry/dune-geometry-targets.cmake
@@ -2939,12 +2974,14 @@
 dpkg-buildpackage: info: binary-only upload (no source included)
 dpkg-genchanges: info: including full source code in upload
 I: copying local configuration
+I: user script /srv/workspace/pbuilder/449318/tmp/hooks/B01_cleanup starting
+I: user script /srv/workspace/pbuilder/449318/tmp/hooks/B01_cleanup finished
 I: unmounting dev/ptmx filesystem
 I: unmounting dev/pts filesystem
 I: unmounting dev/shm filesystem
 I: unmounting proc filesystem
 I: unmounting sys filesystem
 I: cleaning the build env 
-I: removing directory /srv/workspace/pbuilder/1698322 and its subdirectories
-I: Current time: Tue Jan  3 17:05:11 -12 2023
-I: pbuilder-time-stamp: 1672808711
+I: removing directory /srv/workspace/pbuilder/449318 and its subdirectories
+I: Current time: Thu Dec  2 12:45:47 +14 2021
+I: pbuilder-time-stamp: 1638398747