Diff of the two buildlogs:

--
--- b1/build.log	2021-02-18 11:56:43.260347334 +0000
+++ b2/build.log	2021-02-18 12:01:24.111362171 +0000
@@ -1,6 +1,7 @@
+W: cgroups are not available on the host, not using them.
 I: pbuilder: network access will be disabled during build
-I: Current time: Wed Mar 23 06:14:18 -12 2022
-I: pbuilder-time-stamp: 1648059258
+I: Current time: Fri Feb 19 01:56:44 +14 2021
+I: pbuilder-time-stamp: 1613649404
 I: Building the build Environment
 I: extracting base tarball [/var/cache/pbuilder/buster-reproducible-base.tgz]
 I: copying local configuration
@@ -17,7 +18,7 @@
 I: Extracting source
 gpgv: unknown type of key resource 'trustedkeys.kbx'
 gpgv: keyblock resource '/root/.gnupg/trustedkeys.kbx': General error
-gpgv: Signature made Thu Sep 20 03:34:33 2018 -12
+gpgv: Signature made Fri Sep 21 05:34:33 2018 +14
 gpgv:                using RSA key B8CE4DE21080DCF903E16C40F513C419E4B9D0AC
 gpgv:                issuer "ebourg@apache.org"
 gpgv: Can't check signature: No public key
@@ -31,136 +32,169 @@
 dpkg-source: info: applying 03-jaxws-dependency.patch
 I: using fakeroot in build.
 I: Installing the build-deps
-I: user script /srv/workspace/pbuilder/11186/tmp/hooks/D02_print_environment starting
+I: user script /srv/workspace/pbuilder/41345/tmp/hooks/D01_modify_environment starting
+debug: Running on ionos11-amd64.
+I: Changing host+domainname to test build reproducibility
+I: Adding a custom variable just for the fun of it...
+I: Changing /bin/sh to bash
+Removing 'diversion of /bin/sh to /bin/sh.distrib by dash'
+Adding 'diversion of /bin/sh to /bin/sh.distrib by bash'
+Removing 'diversion of /usr/share/man/man1/sh.1.gz to /usr/share/man/man1/sh.distrib.1.gz by dash'
+Adding 'diversion of /usr/share/man/man1/sh.1.gz to /usr/share/man/man1/sh.distrib.1.gz by bash'
+I: Setting pbuilder2's login shell to /bin/bash
+I: Setting pbuilder2's GECOS to second user,second room,second work-phone,second home-phone,second other
+I: user script /srv/workspace/pbuilder/41345/tmp/hooks/D01_modify_environment finished
+I: user script /srv/workspace/pbuilder/41345/tmp/hooks/D02_print_environment starting
 I: set
-  BUILDDIR='/build'
-  BUILDUSERGECOS='first user,first room,first work-phone,first home-phone,first other'
-  BUILDUSERNAME='pbuilder1'
-  BUILD_ARCH='amd64'
-  DEBIAN_FRONTEND='noninteractive'
-  DEB_BUILD_OPTIONS='buildinfo=+all reproducible=+all parallel=16'
-  DISTRIBUTION=''
-  HOME='/root'
-  HOST_ARCH='amd64'
+  BASH=/bin/sh
+  BASHOPTS=checkwinsize:cmdhist:complete_fullquote:extquote:force_fignore:globasciiranges:hostcomplete:interactive_comments:progcomp:promptvars:sourcepath
+  BASH_ALIASES=()
+  BASH_ARGC=()
+  BASH_ARGV=()
+  BASH_CMDS=()
+  BASH_LINENO=([0]="12" [1]="0")
+  BASH_SOURCE=([0]="/tmp/hooks/D02_print_environment" [1]="/tmp/hooks/D02_print_environment")
+  BASH_VERSINFO=([0]="5" [1]="0" [2]="3" [3]="1" [4]="release" [5]="x86_64-pc-linux-gnu")
+  BASH_VERSION='5.0.3(1)-release'
+  BUILDDIR=/build
+  BUILDUSERGECOS='second user,second room,second work-phone,second home-phone,second other'
+  BUILDUSERNAME=pbuilder2
+  BUILD_ARCH=amd64
+  DEBIAN_FRONTEND=noninteractive
+  DEB_BUILD_OPTIONS='buildinfo=+all reproducible=+all parallel=15'
+  DIRSTACK=()
+  DISTRIBUTION=
+  EUID=0
+  FUNCNAME=([0]="Echo" [1]="main")
+  GROUPS=()
+  HOME=/root
+  HOSTNAME=i-capture-the-hostname
+  HOSTTYPE=x86_64
+  HOST_ARCH=amd64
   IFS=' 	
   '
-  INVOCATION_ID='af055e0e51b84ed08819ef99ff541f96'
-  LANG='C'
-  LANGUAGE='en_US:en'
-  LC_ALL='C'
-  MAIL='/var/mail/root'
-  OPTIND='1'
-  PATH='/usr/sbin:/usr/bin:/sbin:/bin:/usr/games'
-  PBCURRENTCOMMANDLINEOPERATION='build'
-  PBUILDER_OPERATION='build'
-  PBUILDER_PKGDATADIR='/usr/share/pbuilder'
-  PBUILDER_PKGLIBDIR='/usr/lib/pbuilder'
-  PBUILDER_SYSCONFDIR='/etc'
-  PPID='11186'
-  PS1='# '
-  PS2='> '
+  LANG=C
+  LANGUAGE=et_EE:et
+  LC_ALL=C
+  MACHTYPE=x86_64-pc-linux-gnu
+  MAIL=/var/mail/root
+  OPTERR=1
+  OPTIND=1
+  OSTYPE=linux-gnu
+  PATH=/usr/sbin:/usr/bin:/sbin:/bin:/usr/games:/i/capture/the/path
+  PBCURRENTCOMMANDLINEOPERATION=build
+  PBUILDER_OPERATION=build
+  PBUILDER_PKGDATADIR=/usr/share/pbuilder
+  PBUILDER_PKGLIBDIR=/usr/lib/pbuilder
+  PBUILDER_SYSCONFDIR=/etc
+  PIPESTATUS=([0]="0")
+  POSIXLY_CORRECT=y
+  PPID=41345
   PS4='+ '
-  PWD='/'
-  SHELL='/bin/bash'
-  SHLVL='2'
-  SUDO_COMMAND='/usr/bin/timeout -k 18.1h 18h /usr/bin/ionice -c 3 /usr/bin/nice /usr/sbin/pbuilder --build --configfile /srv/reproducible-results/rbuild-debian/tmp.IPGne6LbF3/pbuilderrc_yo7A --hookdir /etc/pbuilder/first-build-hooks --debbuildopts -b --basetgz /var/cache/pbuilder/buster-reproducible-base.tgz --buildresult /srv/reproducible-results/rbuild-debian/tmp.IPGne6LbF3/b1 --logfile b1/build.log jmock2_2.8.4-1.dsc'
-  SUDO_GID='110'
-  SUDO_UID='105'
-  SUDO_USER='jenkins'
-  TERM='unknown'
-  TZ='/usr/share/zoneinfo/Etc/GMT+12'
-  USER='root'
-  _='/usr/bin/systemd-run'
-  http_proxy='http://85.184.249.68:3128'
+  PWD=/
+  SHELL=/bin/bash
+  SHELLOPTS=braceexpand:errexit:hashall:interactive-comments:posix
+  SHLVL=3
+  SUDO_COMMAND='/usr/bin/timeout -k 24.1h 24h /usr/bin/ionice -c 3 /usr/bin/nice -n 11 /usr/bin/unshare --uts -- /usr/sbin/pbuilder --build --configfile /srv/reproducible-results/rbuild-debian/tmp.IPGne6LbF3/pbuilderrc_tzLB --hookdir /etc/pbuilder/rebuild-hooks --debbuildopts -b --basetgz /var/cache/pbuilder/buster-reproducible-base.tgz --buildresult /srv/reproducible-results/rbuild-debian/tmp.IPGne6LbF3/b2 --logfile b2/build.log jmock2_2.8.4-1.dsc'
+  SUDO_GID=111
+  SUDO_UID=106
+  SUDO_USER=jenkins
+  TERM=unknown
+  TZ=/usr/share/zoneinfo/Etc/GMT-14
+  UID=0
+  USER=root
+  _='I: set'
+  http_proxy=http://78.137.99.97:3128
 I: uname -a
-  Linux ionos5-amd64 5.10.0-0.bpo.3-amd64 #1 SMP Debian 5.10.13-1~bpo10+1 (2021-02-11) x86_64 GNU/Linux
+  Linux i-capture-the-hostname 4.19.0-14-amd64 #1 SMP Debian 4.19.171-2 (2021-01-30) x86_64 GNU/Linux
 I: ls -l /bin
   total 5116
-  -rwxr-xr-x 1 root root 1168776 Apr 17  2019 bash
-  -rwxr-xr-x 3 root root   38984 Jul 10  2019 bunzip2
-  -rwxr-xr-x 3 root root   38984 Jul 10  2019 bzcat
-  lrwxrwxrwx 1 root root       6 Jul 10  2019 bzcmp -> bzdiff
-  -rwxr-xr-x 1 root root    2227 Jul 10  2019 bzdiff
-  lrwxrwxrwx 1 root root       6 Jul 10  2019 bzegrep -> bzgrep
-  -rwxr-xr-x 1 root root    4877 Jun 24  2019 bzexe
-  lrwxrwxrwx 1 root root       6 Jul 10  2019 bzfgrep -> bzgrep
-  -rwxr-xr-x 1 root root    3641 Jul 10  2019 bzgrep
-  -rwxr-xr-x 3 root root   38984 Jul 10  2019 bzip2
-  -rwxr-xr-x 1 root root   14328 Jul 10  2019 bzip2recover
-  lrwxrwxrwx 1 root root       6 Jul 10  2019 bzless -> bzmore
-  -rwxr-xr-x 1 root root    1297 Jul 10  2019 bzmore
-  -rwxr-xr-x 1 root root   43744 Feb 28  2019 cat
-  -rwxr-xr-x 1 root root   64320 Feb 28  2019 chgrp
-  -rwxr-xr-x 1 root root   64288 Feb 28  2019 chmod
-  -rwxr-xr-x 1 root root   72512 Feb 28  2019 chown
-  -rwxr-xr-x 1 root root  146880 Feb 28  2019 cp
-  -rwxr-xr-x 1 root root  121464 Jan 17  2019 dash
-  -rwxr-xr-x 1 root root  109408 Feb 28  2019 date
-  -rwxr-xr-x 1 root root   76712 Feb 28  2019 dd
-  -rwxr-xr-x 1 root root   93744 Feb 28  2019 df
-  -rwxr-xr-x 1 root root  138856 Feb 28  2019 dir
-  -rwxr-xr-x 1 root root   84288 Jan  9  2019 dmesg
-  lrwxrwxrwx 1 root root       8 Sep 26  2018 dnsdomainname -> hostname
-  lrwxrwxrwx 1 root root       8 Sep 26  2018 domainname -> hostname
-  -rwxr-xr-x 1 root root   39520 Feb 28  2019 echo
-  -rwxr-xr-x 1 root root      28 Jan  7  2019 egrep
-  -rwxr-xr-x 1 root root   35424 Feb 28  2019 false
-  -rwxr-xr-x 1 root root      28 Jan  7  2019 fgrep
-  -rwxr-xr-x 1 root root   68880 Jan  9  2019 findmnt
-  -rwsr-xr-x 1 root root   34896 Apr 22  2020 fusermount
-  -rwxr-xr-x 1 root root  198976 Jan  7  2019 grep
-  -rwxr-xr-x 2 root root    2345 Jan  5  2019 gunzip
-  -rwxr-xr-x 1 root root    6375 Jan  5  2019 gzexe
-  -rwxr-xr-x 1 root root   98048 Jan  5  2019 gzip
-  -rwxr-xr-x 1 root root   26696 Sep 26  2018 hostname
-  -rwxr-xr-x 1 root root   68552 Feb 28  2019 ln
-  -rwxr-xr-x 1 root root   56760 Jul 26  2018 login
-  -rwxr-xr-x 1 root root  138856 Feb 28  2019 ls
-  -rwxr-xr-x 1 root root  108624 Jan  9  2019 lsblk
-  -rwxr-xr-x 1 root root   89088 Feb 28  2019 mkdir
-  -rwxr-xr-x 1 root root   68544 Feb 28  2019 mknod
-  -rwxr-xr-x 1 root root   43808 Feb 28  2019 mktemp
-  -rwxr-xr-x 1 root root   43008 Jan  9  2019 more
-  -rwsr-xr-x 1 root root   51280 Jan  9  2019 mount
-  -rwxr-xr-x 1 root root   14408 Jan  9  2019 mountpoint
-  -rwxr-xr-x 1 root root  138728 Feb 28  2019 mv
-  lrwxrwxrwx 1 root root       8 Sep 26  2018 nisdomainname -> hostname
-  lrwxrwxrwx 1 root root      14 Feb 14  2019 pidof -> /sbin/killall5
-  -rwxr-xr-x 1 root root   39616 Feb 28  2019 pwd
-  lrwxrwxrwx 1 root root       4 Apr 17  2019 rbash -> bash
-  -rwxr-xr-x 1 root root   47776 Feb 28  2019 readlink
-  -rwxr-xr-x 1 root root   68416 Feb 28  2019 rm
-  -rwxr-xr-x 1 root root   47776 Feb 28  2019 rmdir
-  -rwxr-xr-x 1 root root   23312 Jan 21  2019 run-parts
-  -rwxr-xr-x 1 root root  122224 Dec 22  2018 sed
-  lrwxrwxrwx 1 root root       4 Mar 12 02:46 sh -> dash
-  -rwxr-xr-x 1 root root   39552 Feb 28  2019 sleep
-  -rwxr-xr-x 1 root root   80672 Feb 28  2019 stty
-  -rwsr-xr-x 1 root root   63568 Jan  9  2019 su
-  -rwxr-xr-x 1 root root   35488 Feb 28  2019 sync
-  -rwxr-xr-x 1 root root  445560 Apr 23  2019 tar
-  -rwxr-xr-x 1 root root   14440 Jan 21  2019 tempfile
-  -rwxr-xr-x 1 root root   97152 Feb 28  2019 touch
-  -rwxr-xr-x 1 root root   35424 Feb 28  2019 true
-  -rwxr-xr-x 1 root root   14328 Apr 22  2020 ulockmgr_server
-  -rwsr-xr-x 1 root root   34888 Jan  9  2019 umount
-  -rwxr-xr-x 1 root root   39584 Feb 28  2019 uname
-  -rwxr-xr-x 2 root root    2345 Jan  5  2019 uncompress
-  -rwxr-xr-x 1 root root  138856 Feb 28  2019 vdir
-  -rwxr-xr-x 1 root root   34896 Jan  9  2019 wdctl
-  -rwxr-xr-x 1 root root     946 Jan 21  2019 which
-  lrwxrwxrwx 1 root root       8 Sep 26  2018 ypdomainname -> hostname
-  -rwxr-xr-x 1 root root    1983 Jan  5  2019 zcat
-  -rwxr-xr-x 1 root root    1677 Jan  5  2019 zcmp
-  -rwxr-xr-x 1 root root    5879 Jan  5  2019 zdiff
-  -rwxr-xr-x 1 root root      29 Jan  5  2019 zegrep
-  -rwxr-xr-x 1 root root      29 Jan  5  2019 zfgrep
-  -rwxr-xr-x 1 root root    2080 Jan  5  2019 zforce
-  -rwxr-xr-x 1 root root    7584 Jan  5  2019 zgrep
-  -rwxr-xr-x 1 root root    2205 Jan  5  2019 zless
-  -rwxr-xr-x 1 root root    1841 Jan  5  2019 zmore
-  -rwxr-xr-x 1 root root    4552 Jan  5  2019 znew
-I: user script /srv/workspace/pbuilder/11186/tmp/hooks/D02_print_environment finished
+  -rwxr-xr-x 1 root root 1168776 Apr 18  2019 bash
+  -rwxr-xr-x 3 root root   38984 Jul 11  2019 bunzip2
+  -rwxr-xr-x 3 root root   38984 Jul 11  2019 bzcat
+  lrwxrwxrwx 1 root root       6 Jul 11  2019 bzcmp -> bzdiff
+  -rwxr-xr-x 1 root root    2227 Jul 11  2019 bzdiff
+  lrwxrwxrwx 1 root root       6 Jul 11  2019 bzegrep -> bzgrep
+  -rwxr-xr-x 1 root root    4877 Jun 25  2019 bzexe
+  lrwxrwxrwx 1 root root       6 Jul 11  2019 bzfgrep -> bzgrep
+  -rwxr-xr-x 1 root root    3641 Jul 11  2019 bzgrep
+  -rwxr-xr-x 3 root root   38984 Jul 11  2019 bzip2
+  -rwxr-xr-x 1 root root   14328 Jul 11  2019 bzip2recover
+  lrwxrwxrwx 1 root root       6 Jul 11  2019 bzless -> bzmore
+  -rwxr-xr-x 1 root root    1297 Jul 11  2019 bzmore
+  -rwxr-xr-x 1 root root   43744 Mar  1  2019 cat
+  -rwxr-xr-x 1 root root   64320 Mar  1  2019 chgrp
+  -rwxr-xr-x 1 root root   64288 Mar  1  2019 chmod
+  -rwxr-xr-x 1 root root   72512 Mar  1  2019 chown
+  -rwxr-xr-x 1 root root  146880 Mar  1  2019 cp
+  -rwxr-xr-x 1 root root  121464 Jan 18  2019 dash
+  -rwxr-xr-x 1 root root  109408 Mar  1  2019 date
+  -rwxr-xr-x 1 root root   76712 Mar  1  2019 dd
+  -rwxr-xr-x 1 root root   93744 Mar  1  2019 df
+  -rwxr-xr-x 1 root root  138856 Mar  1  2019 dir
+  -rwxr-xr-x 1 root root   84288 Jan 10  2019 dmesg
+  lrwxrwxrwx 1 root root       8 Sep 27  2018 dnsdomainname -> hostname
+  lrwxrwxrwx 1 root root       8 Sep 27  2018 domainname -> hostname
+  -rwxr-xr-x 1 root root   39520 Mar  1  2019 echo
+  -rwxr-xr-x 1 root root      28 Jan  8  2019 egrep
+  -rwxr-xr-x 1 root root   35424 Mar  1  2019 false
+  -rwxr-xr-x 1 root root      28 Jan  8  2019 fgrep
+  -rwxr-xr-x 1 root root   68880 Jan 10  2019 findmnt
+  -rwsr-xr-x 1 root root   34896 Apr 23  2020 fusermount
+  -rwxr-xr-x 1 root root  198976 Jan  8  2019 grep
+  -rwxr-xr-x 2 root root    2345 Jan  6  2019 gunzip
+  -rwxr-xr-x 1 root root    6375 Jan  6  2019 gzexe
+  -rwxr-xr-x 1 root root   98048 Jan  6  2019 gzip
+  -rwxr-xr-x 1 root root   26696 Sep 27  2018 hostname
+  -rwxr-xr-x 1 root root   68552 Mar  1  2019 ln
+  -rwxr-xr-x 1 root root   56760 Jul 27  2018 login
+  -rwxr-xr-x 1 root root  138856 Mar  1  2019 ls
+  -rwxr-xr-x 1 root root  108624 Jan 10  2019 lsblk
+  -rwxr-xr-x 1 root root   89088 Mar  1  2019 mkdir
+  -rwxr-xr-x 1 root root   68544 Mar  1  2019 mknod
+  -rwxr-xr-x 1 root root   43808 Mar  1  2019 mktemp
+  -rwxr-xr-x 1 root root   43008 Jan 10  2019 more
+  -rwsr-xr-x 1 root root   51280 Jan 10  2019 mount
+  -rwxr-xr-x 1 root root   14408 Jan 10  2019 mountpoint
+  -rwxr-xr-x 1 root root  138728 Mar  1  2019 mv
+  lrwxrwxrwx 1 root root       8 Sep 27  2018 nisdomainname -> hostname
+  lrwxrwxrwx 1 root root      14 Feb 15  2019 pidof -> /sbin/killall5
+  -rwxr-xr-x 1 root root   39616 Mar  1  2019 pwd
+  lrwxrwxrwx 1 root root       4 Apr 18  2019 rbash -> bash
+  -rwxr-xr-x 1 root root   47776 Mar  1  2019 readlink
+  -rwxr-xr-x 1 root root   68416 Mar  1  2019 rm
+  -rwxr-xr-x 1 root root   47776 Mar  1  2019 rmdir
+  -rwxr-xr-x 1 root root   23312 Jan 22  2019 run-parts
+  -rwxr-xr-x 1 root root  122224 Dec 23  2018 sed
+  lrwxrwxrwx 1 root root       4 Feb 19 01:56 sh -> bash
+  lrwxrwxrwx 1 root root       4 Feb  7 22:24 sh.distrib -> dash
+  -rwxr-xr-x 1 root root   39552 Mar  1  2019 sleep
+  -rwxr-xr-x 1 root root   80672 Mar  1  2019 stty
+  -rwsr-xr-x 1 root root   63568 Jan 10  2019 su
+  -rwxr-xr-x 1 root root   35488 Mar  1  2019 sync
+  -rwxr-xr-x 1 root root  445560 Apr 24  2019 tar
+  -rwxr-xr-x 1 root root   14440 Jan 22  2019 tempfile
+  -rwxr-xr-x 1 root root   97152 Mar  1  2019 touch
+  -rwxr-xr-x 1 root root   35424 Mar  1  2019 true
+  -rwxr-xr-x 1 root root   14328 Apr 23  2020 ulockmgr_server
+  -rwsr-xr-x 1 root root   34888 Jan 10  2019 umount
+  -rwxr-xr-x 1 root root   39584 Mar  1  2019 uname
+  -rwxr-xr-x 2 root root    2345 Jan  6  2019 uncompress
+  -rwxr-xr-x 1 root root  138856 Mar  1  2019 vdir
+  -rwxr-xr-x 1 root root   34896 Jan 10  2019 wdctl
+  -rwxr-xr-x 1 root root     946 Jan 22  2019 which
+  lrwxrwxrwx 1 root root       8 Sep 27  2018 ypdomainname -> hostname
+  -rwxr-xr-x 1 root root    1983 Jan  6  2019 zcat
+  -rwxr-xr-x 1 root root    1677 Jan  6  2019 zcmp
+  -rwxr-xr-x 1 root root    5879 Jan  6  2019 zdiff
+  -rwxr-xr-x 1 root root      29 Jan  6  2019 zegrep
+  -rwxr-xr-x 1 root root      29 Jan  6  2019 zfgrep
+  -rwxr-xr-x 1 root root    2080 Jan  6  2019 zforce
+  -rwxr-xr-x 1 root root    7584 Jan  6  2019 zgrep
+  -rwxr-xr-x 1 root root    2205 Jan  6  2019 zless
+  -rwxr-xr-x 1 root root    1841 Jan  6  2019 zmore
+  -rwxr-xr-x 1 root root    4552 Jan  6  2019 znew
+I: user script /srv/workspace/pbuilder/41345/tmp/hooks/D02_print_environment finished
  -> Attempting to satisfy build-dependencies
  -> Creating pbuilder-satisfydepends-dummy package
 Package: pbuilder-satisfydepends-dummy
@@ -472,7 +506,7 @@
 Get: 248 http://deb.debian.org/debian buster/main amd64 maven all 3.6.0-1 [22.1 kB]
 Get: 249 http://deb.debian.org/debian buster/main amd64 maven-repo-helper all 1.9.3 [142 kB]
 Get: 250 http://deb.debian.org/debian buster/main amd64 maven-debian-helper all 2.3.2 [122 kB]
-Fetched 364 MB in 5s (71.8 MB/s)
+Fetched 364 MB in 6s (59.6 MB/s)
 debconf: delaying package configuration, since apt-utils is not installed
 Selecting previously unselected package libbsd0:amd64.
 (Reading database ... 
(Reading database ... 5%
(Reading database ... 10%
(Reading database ... 15%
(Reading database ... 20%
(Reading database ... 25%
(Reading database ... 30%
(Reading database ... 35%
(Reading database ... 40%
(Reading database ... 45%
(Reading database ... 50%
(Reading database ... 55%
(Reading database ... 60%
(Reading database ... 65%
(Reading database ... 70%
(Reading database ... 75%
(Reading database ... 80%
(Reading database ... 85%
(Reading database ... 90%
(Reading database ... 95%
(Reading database ... 100%
(Reading database ... 19195 files and directories currently installed.)
@@ -1684,7 +1718,7 @@
 fakeroot is already the newest version (1.23-1).
 0 upgraded, 0 newly installed, 0 to remove and 0 not upgraded.
 I: Building the package
-I: Running cd /build/jmock2-2.8.4/ && env PATH="/usr/sbin:/usr/bin:/sbin:/bin:/usr/games" HOME="/nonexistent/first-build" dpkg-buildpackage -us -uc -b
+I: Running cd /build/jmock2-2.8.4/ && env PATH="/usr/sbin:/usr/bin:/sbin:/bin:/usr/games:/i/capture/the/path" HOME="/nonexistent/second-build" dpkg-buildpackage -us -uc -b
 dpkg-buildpackage: info: source package jmock2
 dpkg-buildpackage: info: source version 2.8.4-1
 dpkg-buildpackage: info: source distribution unstable
@@ -1859,9 +1893,9 @@
 [INFO] /build/jmock2-2.8.4/jmock/src/main/java/org/jmock/Mockery.java: Recompile with -Xlint:unchecked for details.
 [INFO] 
 [INFO] --- exec-maven-plugin:1.6.0:exec (default) @ jmock ---
-Mar 23, 2022 6:15:51 AM org.jmock.ExpectationsCreator main
+Feb 19, 2021 1:58:12 AM org.jmock.ExpectationsCreator main
 INFO: Expections Old School method injector running
-Mar 23, 2022 6:15:51 AM org.jmock.ExpectationsCreator main
+Feb 19, 2021 1:58:12 AM org.jmock.ExpectationsCreator main
 INFO: Running in /build/jmock2-2.8.4/jmock
 [INFO] 
 [INFO] --- maven-resources-plugin:3.1.0:testResources (default-testResources) @ jmock ---
@@ -3006,17 +3040,17 @@
 [INFO] ------------------------------------------------------------------------
 [INFO] Reactor Summary for jMock 2 Parent 2.8.4:
 [INFO] 
-[INFO] jMock 2 Parent ..................................... SUCCESS [  5.565 s]
-[INFO] jMock 2 Test Jar ................................... SUCCESS [  9.106 s]
-[INFO] jMock 2 Core ....................................... SUCCESS [ 14.979 s]
-[INFO] jmock-junit3 ....................................... SUCCESS [  5.795 s]
-[INFO] jmock-junit4 ....................................... SUCCESS [  7.975 s]
-[INFO] jmock-legacy ....................................... SUCCESS [  7.655 s]
+[INFO] jMock 2 Parent ..................................... SUCCESS [  5.366 s]
+[INFO] jMock 2 Test Jar ................................... SUCCESS [  6.564 s]
+[INFO] jMock 2 Core ....................................... SUCCESS [ 13.950 s]
+[INFO] jmock-junit3 ....................................... SUCCESS [  5.189 s]
+[INFO] jmock-junit4 ....................................... SUCCESS [  5.191 s]
+[INFO] jmock-legacy ....................................... SUCCESS [  4.984 s]
 [INFO] ------------------------------------------------------------------------
 [INFO] BUILD SUCCESS
 [INFO] ------------------------------------------------------------------------
-[INFO] Total time:  52.643 s
-[INFO] Finished at: 2022-03-23T06:16:31-12:00
+[INFO] Total time:  42.774 s
+[INFO] Finished at: 2021-02-19T01:58:45+14:00
 [INFO] ------------------------------------------------------------------------
    dh_auto_test
 	/usr/lib/jvm/default-java/bin/java -noverify -cp /usr/share/maven/boot/plexus-classworlds-2.x.jar -Dmaven.home=/usr/share/maven -Dmaven.multiModuleProjectDirectory=/build/jmock2-2.8.4 -Dclassworlds.conf=/etc/maven/m2-debian.conf -Dproperties.file.manual=/build/jmock2-2.8.4/debian/maven.properties org.codehaus.plexus.classworlds.launcher.Launcher -s/etc/maven/settings-debian.xml -Ddebian.dir=/build/jmock2-2.8.4/debian -Dmaven.repo.local=/build/jmock2-2.8.4/debian/maven-repo --batch-mode test
@@ -3073,9 +3107,9 @@
 [INFO] Nothing to compile - all classes are up to date
 [INFO] 
 [INFO] --- exec-maven-plugin:1.6.0:exec (default) @ jmock ---
-Mar 23, 2022 6:16:36 AM org.jmock.ExpectationsCreator main
+Feb 19, 2021 1:58:48 AM org.jmock.ExpectationsCreator main
 INFO: Expections Old School method injector running
-Mar 23, 2022 6:16:36 AM org.jmock.ExpectationsCreator main
+Feb 19, 2021 1:58:48 AM org.jmock.ExpectationsCreator main
 INFO: Running in /build/jmock2-2.8.4/jmock
 [INFO] 
 [INFO] --- maven-resources-plugin:3.1.0:testResources (default-testResources) @ jmock ---
@@ -3091,9 +3125,9 @@
 [INFO]  T E S T S
 [INFO] -------------------------------------------------------
 [INFO] Running org.jmock.test.acceptance.NullAndNonNullAcceptanceTests
-[INFO] Tests run: 4, Failures: 0, Errors: 0, Skipped: 0, Time elapsed: 0.067 s - in org.jmock.test.acceptance.NullAndNonNullAcceptanceTests
+[INFO] Tests run: 4, Failures: 0, Errors: 0, Skipped: 0, Time elapsed: 0.045 s - in org.jmock.test.acceptance.NullAndNonNullAcceptanceTests
 [INFO] Running org.jmock.test.acceptance.FlexibleExpectationsAcceptanceTests
-[INFO] Tests run: 5, Failures: 0, Errors: 0, Skipped: 0, Time elapsed: 0.001 s - in org.jmock.test.acceptance.FlexibleExpectationsAcceptanceTests
+[INFO] Tests run: 5, Failures: 0, Errors: 0, Skipped: 0, Time elapsed: 0.002 s - in org.jmock.test.acceptance.FlexibleExpectationsAcceptanceTests
 [INFO] Running org.jmock.test.acceptance.UnorderedExpectationsAcceptanceTests
 [INFO] Tests run: 5, Failures: 0, Errors: 0, Skipped: 0, Time elapsed: 0.001 s - in org.jmock.test.acceptance.UnorderedExpectationsAcceptanceTests
 [INFO] Running org.jmock.test.acceptance.StatesAcceptanceTest
@@ -3101,119 +3135,119 @@
 [INFO] Running org.jmock.test.acceptance.DoAllAcceptanceTests
 [INFO] Tests run: 1, Failures: 0, Errors: 0, Skipped: 0, Time elapsed: 0.001 s - in org.jmock.test.acceptance.DoAllAcceptanceTests
 [INFO] Running org.jmock.test.acceptance.NewStyleParameterMatchingAcceptanceTests
-[INFO] Tests run: 6, Failures: 0, Errors: 0, Skipped: 0, Time elapsed: 0.002 s - in org.jmock.test.acceptance.NewStyleParameterMatchingAcceptanceTests
+[INFO] Tests run: 6, Failures: 0, Errors: 0, Skipped: 0, Time elapsed: 0.001 s - in org.jmock.test.acceptance.NewStyleParameterMatchingAcceptanceTests
 [INFO] Running org.jmock.test.acceptance.PrimitiveParameterTypesAcceptanceTests
-[INFO] Tests run: 3, Failures: 0, Errors: 0, Skipped: 0, Time elapsed: 0.015 s - in org.jmock.test.acceptance.PrimitiveParameterTypesAcceptanceTests
+[INFO] Tests run: 3, Failures: 0, Errors: 0, Skipped: 0, Time elapsed: 0.025 s - in org.jmock.test.acceptance.PrimitiveParameterTypesAcceptanceTests
 [INFO] Running org.jmock.test.acceptance.ThrowingExceptionsAcceptanceTests
-[INFO] Tests run: 4, Failures: 0, Errors: 0, Skipped: 0, Time elapsed: 0.004 s - in org.jmock.test.acceptance.ThrowingExceptionsAcceptanceTests
+[INFO] Tests run: 4, Failures: 0, Errors: 0, Skipped: 0, Time elapsed: 0.003 s - in org.jmock.test.acceptance.ThrowingExceptionsAcceptanceTests
 [INFO] Running org.jmock.test.acceptance.CascadedFailuresAcceptanceTests
-[INFO] Tests run: 3, Failures: 0, Errors: 0, Skipped: 0, Time elapsed: 0.003 s - in org.jmock.test.acceptance.CascadedFailuresAcceptanceTests
+[INFO] Tests run: 3, Failures: 0, Errors: 0, Skipped: 0, Time elapsed: 0.004 s - in org.jmock.test.acceptance.CascadedFailuresAcceptanceTests
 [INFO] Running org.jmock.test.acceptance.ConsecutiveCallsAcceptanceTests
-[INFO] Tests run: 1, Failures: 0, Errors: 0, Skipped: 0, Time elapsed: 0 s - in org.jmock.test.acceptance.ConsecutiveCallsAcceptanceTests
+[INFO] Tests run: 1, Failures: 0, Errors: 0, Skipped: 0, Time elapsed: 0.001 s - in org.jmock.test.acceptance.ConsecutiveCallsAcceptanceTests
 [INFO] Running org.jmock.test.acceptance.WarnAboutMultipleThreadsAcceptanceTests
 the Mockery is not thread-safe: use a Synchroniser to ensure thread safety
-[INFO] Tests run: 1, Failures: 0, Errors: 0, Skipped: 0, Time elapsed: 0.004 s - in org.jmock.test.acceptance.WarnAboutMultipleThreadsAcceptanceTests
+[INFO] Tests run: 1, Failures: 0, Errors: 0, Skipped: 0, Time elapsed: 0.01 s - in org.jmock.test.acceptance.WarnAboutMultipleThreadsAcceptanceTests
 [INFO] Running org.jmock.test.acceptance.OverrideExpectationsFromSetUpAcceptanceTests
-[INFO] Tests run: 1, Failures: 0, Errors: 0, Skipped: 0, Time elapsed: 0.001 s - in org.jmock.test.acceptance.OverrideExpectationsFromSetUpAcceptanceTests
+[INFO] Tests run: 1, Failures: 0, Errors: 0, Skipped: 0, Time elapsed: 0.002 s - in org.jmock.test.acceptance.OverrideExpectationsFromSetUpAcceptanceTests
 [INFO] Running org.jmock.test.acceptance.ErrorMessagesAcceptanceTests
-[INFO] Tests run: 9, Failures: 0, Errors: 0, Skipped: 0, Time elapsed: 0.012 s - in org.jmock.test.acceptance.ErrorMessagesAcceptanceTests
+[INFO] Tests run: 9, Failures: 0, Errors: 0, Skipped: 0, Time elapsed: 0.009 s - in org.jmock.test.acceptance.ErrorMessagesAcceptanceTests
 [INFO] Running org.jmock.test.acceptance.ExpectationErrorTranslationAcceptanceTests
-[INFO] Tests run: 2, Failures: 0, Errors: 0, Skipped: 0, Time elapsed: 0.001 s - in org.jmock.test.acceptance.ExpectationErrorTranslationAcceptanceTests
+[INFO] Tests run: 2, Failures: 0, Errors: 0, Skipped: 0, Time elapsed: 0.003 s - in org.jmock.test.acceptance.ExpectationErrorTranslationAcceptanceTests
 [INFO] Running org.jmock.test.acceptance.ReturningValuesAcceptanceTests
-[INFO] Tests run: 16, Failures: 0, Errors: 0, Skipped: 0, Time elapsed: 0.023 s - in org.jmock.test.acceptance.ReturningValuesAcceptanceTests
+[INFO] Tests run: 16, Failures: 0, Errors: 0, Skipped: 0, Time elapsed: 0.008 s - in org.jmock.test.acceptance.ReturningValuesAcceptanceTests
 [INFO] Running org.jmock.test.acceptance.ExpectationErrorCheckingAcceptanceTests
-[INFO] Tests run: 11, Failures: 0, Errors: 0, Skipped: 0, Time elapsed: 0.002 s - in org.jmock.test.acceptance.ExpectationErrorCheckingAcceptanceTests
+[INFO] Tests run: 11, Failures: 0, Errors: 0, Skipped: 0, Time elapsed: 0.003 s - in org.jmock.test.acceptance.ExpectationErrorCheckingAcceptanceTests
 [INFO] Running org.jmock.test.acceptance.RecordingAcceptanceTests
-[INFO] Tests run: 5, Failures: 0, Errors: 0, Skipped: 0, Time elapsed: 0 s - in org.jmock.test.acceptance.RecordingAcceptanceTests
+[INFO] Tests run: 5, Failures: 0, Errors: 0, Skipped: 0, Time elapsed: 0.003 s - in org.jmock.test.acceptance.RecordingAcceptanceTests
 [INFO] Running org.jmock.test.acceptance.SequenceAcceptanceTests
-[INFO] Tests run: 7, Failures: 0, Errors: 0, Skipped: 0, Time elapsed: 0.009 s - in org.jmock.test.acceptance.SequenceAcceptanceTests
+[INFO] Tests run: 7, Failures: 0, Errors: 0, Skipped: 0, Time elapsed: 0.008 s - in org.jmock.test.acceptance.SequenceAcceptanceTests
 [INFO] Running org.jmock.test.acceptance.ReturningIteratorsAcceptanceTests
-[INFO] Tests run: 2, Failures: 0, Errors: 0, Skipped: 0, Time elapsed: 0.009 s - in org.jmock.test.acceptance.ReturningIteratorsAcceptanceTests
+[INFO] Tests run: 2, Failures: 0, Errors: 0, Skipped: 0, Time elapsed: 0.008 s - in org.jmock.test.acceptance.ReturningIteratorsAcceptanceTests
 [INFO] Running org.jmock.test.acceptance.ExpectationCountsAcceptanceTests
-[INFO] Tests run: 7, Failures: 0, Errors: 0, Skipped: 0, Time elapsed: 0.003 s - in org.jmock.test.acceptance.ExpectationCountsAcceptanceTests
+[INFO] Tests run: 7, Failures: 0, Errors: 0, Skipped: 0, Time elapsed: 0.005 s - in org.jmock.test.acceptance.ExpectationCountsAcceptanceTests
 [INFO] Running org.jmock.test.acceptance.ParameterMatchingAcceptanceTests
-[INFO] Tests run: 7, Failures: 0, Errors: 0, Skipped: 0, Time elapsed: 0.009 s - in org.jmock.test.acceptance.ParameterMatchingAcceptanceTests
+[INFO] Tests run: 7, Failures: 0, Errors: 0, Skipped: 0, Time elapsed: 0.008 s - in org.jmock.test.acceptance.ParameterMatchingAcceptanceTests
 [INFO] Running org.jmock.test.acceptance.DefineExpectationWithinExpectationsAcceptanceTests
 [INFO] Tests run: 2, Failures: 0, Errors: 0, Skipped: 0, Time elapsed: 0.004 s - in org.jmock.test.acceptance.DefineExpectationWithinExpectationsAcceptanceTests
 [INFO] Running org.jmock.test.acceptance.UniqueNamesAcceptanceTest
-[INFO] Tests run: 2, Failures: 0, Errors: 0, Skipped: 0, Time elapsed: 0.001 s - in org.jmock.test.acceptance.UniqueNamesAcceptanceTest
+[INFO] Tests run: 2, Failures: 0, Errors: 0, Skipped: 0, Time elapsed: 0 s - in org.jmock.test.acceptance.UniqueNamesAcceptanceTest
 [INFO] Running org.jmock.test.acceptance.HamcrestTypeSafetyAcceptanceTests
 [INFO] Tests run: 1, Failures: 0, Errors: 0, Skipped: 0, Time elapsed: 0 s - in org.jmock.test.acceptance.HamcrestTypeSafetyAcceptanceTests
 [INFO] Running org.jmock.test.acceptance.AnyMethodAcceptanceTests
 [INFO] Tests run: 2, Failures: 0, Errors: 0, Skipped: 0, Time elapsed: 0 s - in org.jmock.test.acceptance.AnyMethodAcceptanceTests
 [INFO] Running org.jmock.test.unit.api.InvocationTests
-[INFO] Tests run: 17, Failures: 0, Errors: 0, Skipped: 0, Time elapsed: 0.051 s - in org.jmock.test.unit.api.InvocationTests
+[INFO] Tests run: 17, Failures: 0, Errors: 0, Skipped: 0, Time elapsed: 0.037 s - in org.jmock.test.unit.api.InvocationTests
 [INFO] Running org.jmock.test.unit.auto.internal.MockomaticTests
-[INFO] Tests run: 4, Failures: 0, Errors: 0, Skipped: 0, Time elapsed: 0.003 s - in org.jmock.test.unit.auto.internal.MockomaticTests
+[INFO] Tests run: 4, Failures: 0, Errors: 0, Skipped: 0, Time elapsed: 0.006 s - in org.jmock.test.unit.auto.internal.MockomaticTests
 [INFO] Running org.jmock.test.unit.MockeryTests
-[INFO] Tests run: 2, Failures: 0, Errors: 0, Skipped: 0, Time elapsed: 0 s - in org.jmock.test.unit.MockeryTests
+[INFO] Tests run: 2, Failures: 0, Errors: 0, Skipped: 0, Time elapsed: 0.002 s - in org.jmock.test.unit.MockeryTests
 [INFO] Running org.jmock.test.unit.lib.LastWordNamingSchemeTests
-[INFO] Tests run: 7, Failures: 0, Errors: 0, Skipped: 0, Time elapsed: 0.006 s - in org.jmock.test.unit.lib.LastWordNamingSchemeTests
+[INFO] Tests run: 7, Failures: 0, Errors: 0, Skipped: 0, Time elapsed: 0.001 s - in org.jmock.test.unit.lib.LastWordNamingSchemeTests
 [INFO] Running org.jmock.test.unit.lib.CurrentStateMatcherTests
-[INFO] Tests run: 9, Failures: 0, Errors: 0, Skipped: 0, Time elapsed: 0.001 s - in org.jmock.test.unit.lib.CurrentStateMatcherTests
+[INFO] Tests run: 9, Failures: 0, Errors: 0, Skipped: 0, Time elapsed: 0.002 s - in org.jmock.test.unit.lib.CurrentStateMatcherTests
 [INFO] Running org.jmock.test.unit.lib.script.ScriptedActionTests
 [INFO] Tests run: 5, Failures: 0, Errors: 0, Skipped: 0, Time elapsed: 0.075 s - in org.jmock.test.unit.lib.script.ScriptedActionTests
 [INFO] Running org.jmock.test.unit.lib.RetroNamingSchemeTests
-[INFO] Tests run: 1, Failures: 0, Errors: 0, Skipped: 0, Time elapsed: 0.001 s - in org.jmock.test.unit.lib.RetroNamingSchemeTests
+[INFO] Tests run: 1, Failures: 0, Errors: 0, Skipped: 0, Time elapsed: 0 s - in org.jmock.test.unit.lib.RetroNamingSchemeTests
 [INFO] Running org.jmock.test.unit.lib.CamelCaseNamingSchemeTests
 [INFO] Tests run: 3, Failures: 0, Errors: 0, Skipped: 0, Time elapsed: 0 s - in org.jmock.test.unit.lib.CamelCaseNamingSchemeTests
 [INFO] Running org.jmock.test.unit.lib.concurrent.DeterministicSchedulerTests
-[INFO] Tests run: 19, Failures: 0, Errors: 0, Skipped: 0, Time elapsed: 0.017 s - in org.jmock.test.unit.lib.concurrent.DeterministicSchedulerTests
+[INFO] Tests run: 19, Failures: 0, Errors: 0, Skipped: 0, Time elapsed: 0.022 s - in org.jmock.test.unit.lib.concurrent.DeterministicSchedulerTests
 [INFO] Running org.jmock.test.unit.lib.concurrent.DeterministicExecutorTests
 [INFO] Tests run: 3, Failures: 0, Errors: 0, Skipped: 0, Time elapsed: 0 s - in org.jmock.test.unit.lib.concurrent.DeterministicExecutorTests
 [INFO] Running org.jmock.test.unit.lib.concurrent.internal.DeltaQueueTests
-[INFO] Tests run: 13, Failures: 0, Errors: 0, Skipped: 0, Time elapsed: 0 s - in org.jmock.test.unit.lib.concurrent.internal.DeltaQueueTests
+[INFO] Tests run: 13, Failures: 0, Errors: 0, Skipped: 0, Time elapsed: 0.004 s - in org.jmock.test.unit.lib.concurrent.internal.DeltaQueueTests
 [INFO] Running org.jmock.test.unit.lib.concurrent.BlitzerTests
 the Mockery is not thread-safe: use a Synchroniser to ensure thread safety
-[INFO] Tests run: 3, Failures: 0, Errors: 0, Skipped: 0, Time elapsed: 0.088 s - in org.jmock.test.unit.lib.concurrent.BlitzerTests
+[INFO] Tests run: 3, Failures: 0, Errors: 0, Skipped: 0, Time elapsed: 0.048 s - in org.jmock.test.unit.lib.concurrent.BlitzerTests
 [INFO] Running org.jmock.test.unit.lib.IdentityExpectationErrorTranslatorTests
-[INFO] Tests run: 1, Failures: 0, Errors: 0, Skipped: 0, Time elapsed: 0 s - in org.jmock.test.unit.lib.IdentityExpectationErrorTranslatorTests
+[INFO] Tests run: 1, Failures: 0, Errors: 0, Skipped: 0, Time elapsed: 0.001 s - in org.jmock.test.unit.lib.IdentityExpectationErrorTranslatorTests
 [INFO] Running org.jmock.test.unit.lib.JavaReflectionImposteriserTests
-[INFO] Tests run: 4, Failures: 0, Errors: 0, Skipped: 0, Time elapsed: 0.006 s - in org.jmock.test.unit.lib.JavaReflectionImposteriserTests
+[INFO] Tests run: 4, Failures: 0, Errors: 0, Skipped: 0, Time elapsed: 0.011 s - in org.jmock.test.unit.lib.JavaReflectionImposteriserTests
 [INFO] Running org.jmock.test.unit.lib.action.VoidActionTests
-[INFO] Tests run: 2, Failures: 0, Errors: 0, Skipped: 0, Time elapsed: 0.002 s - in org.jmock.test.unit.lib.action.VoidActionTests
+[INFO] Tests run: 2, Failures: 0, Errors: 0, Skipped: 0, Time elapsed: 0.001 s - in org.jmock.test.unit.lib.action.VoidActionTests
 [INFO] Running org.jmock.test.unit.lib.action.CustomActionTests
-[INFO] Tests run: 1, Failures: 0, Errors: 0, Skipped: 0, Time elapsed: 0 s - in org.jmock.test.unit.lib.action.CustomActionTests
+[INFO] Tests run: 1, Failures: 0, Errors: 0, Skipped: 0, Time elapsed: 0.001 s - in org.jmock.test.unit.lib.action.CustomActionTests
 [INFO] Running org.jmock.test.unit.lib.action.ReturnEnumerationActionTests
-[INFO] Tests run: 4, Failures: 0, Errors: 0, Skipped: 0, Time elapsed: 0.002 s - in org.jmock.test.unit.lib.action.ReturnEnumerationActionTests
+[INFO] Tests run: 4, Failures: 0, Errors: 0, Skipped: 0, Time elapsed: 0.003 s - in org.jmock.test.unit.lib.action.ReturnEnumerationActionTests
 [INFO] Running org.jmock.test.unit.lib.action.ActionSequenceTests
-[INFO] Tests run: 3, Failures: 0, Errors: 0, Skipped: 0, Time elapsed: 0 s - in org.jmock.test.unit.lib.action.ActionSequenceTests
+[INFO] Tests run: 3, Failures: 0, Errors: 0, Skipped: 0, Time elapsed: 0.002 s - in org.jmock.test.unit.lib.action.ActionSequenceTests
 [INFO] Running org.jmock.test.unit.lib.action.ReturnValueActionTests
 [INFO] Tests run: 3, Failures: 0, Errors: 0, Skipped: 0, Time elapsed: 0 s - in org.jmock.test.unit.lib.action.ReturnValueActionTests
 [INFO] Running org.jmock.test.unit.lib.action.DoAllActionTests
-[INFO] Tests run: 3, Failures: 0, Errors: 0, Skipped: 0, Time elapsed: 0 s - in org.jmock.test.unit.lib.action.DoAllActionTests
+[INFO] Tests run: 3, Failures: 0, Errors: 0, Skipped: 0, Time elapsed: 0.001 s - in org.jmock.test.unit.lib.action.DoAllActionTests
 [INFO] Running org.jmock.test.unit.lib.action.ReturnIteratorActionTests
-[INFO] Tests run: 4, Failures: 0, Errors: 0, Skipped: 0, Time elapsed: 0 s - in org.jmock.test.unit.lib.action.ReturnIteratorActionTests
+[INFO] Tests run: 4, Failures: 0, Errors: 0, Skipped: 0, Time elapsed: 0.001 s - in org.jmock.test.unit.lib.action.ReturnIteratorActionTests
 [INFO] Running org.jmock.test.unit.lib.action.ThrowActionTests
-[INFO] Tests run: 7, Failures: 0, Errors: 0, Skipped: 0, Time elapsed: 0 s - in org.jmock.test.unit.lib.action.ThrowActionTests
+[INFO] Tests run: 7, Failures: 0, Errors: 0, Skipped: 0, Time elapsed: 0.005 s - in org.jmock.test.unit.lib.action.ThrowActionTests
 [INFO] Running org.jmock.test.unit.support.MethodFactoryTests
-[INFO] Tests run: 2, Failures: 0, Errors: 0, Skipped: 0, Time elapsed: 0.001 s - in org.jmock.test.unit.support.MethodFactoryTests
+[INFO] Tests run: 2, Failures: 0, Errors: 0, Skipped: 0, Time elapsed: 0 s - in org.jmock.test.unit.support.MethodFactoryTests
 [INFO] Running org.jmock.test.unit.internal.StateMachineTests
-[INFO] Tests run: 7, Failures: 0, Errors: 0, Skipped: 0, Time elapsed: 0 s - in org.jmock.test.unit.internal.StateMachineTests
+[INFO] Tests run: 7, Failures: 0, Errors: 0, Skipped: 0, Time elapsed: 0.003 s - in org.jmock.test.unit.internal.StateMachineTests
 [INFO] Running org.jmock.test.unit.internal.VerifyingTestCaseTests
-[INFO] Tests run: 6, Failures: 0, Errors: 0, Skipped: 0, Time elapsed: 0.001 s - in org.jmock.test.unit.internal.VerifyingTestCaseTests
+[INFO] Tests run: 6, Failures: 0, Errors: 0, Skipped: 0, Time elapsed: 0.003 s - in org.jmock.test.unit.internal.VerifyingTestCaseTests
 [INFO] Running org.jmock.test.unit.internal.ChangeStateSideEffectTests
-[INFO] Tests run: 2, Failures: 0, Errors: 0, Skipped: 0, Time elapsed: 0.001 s - in org.jmock.test.unit.internal.ChangeStateSideEffectTests
+[INFO] Tests run: 2, Failures: 0, Errors: 0, Skipped: 0, Time elapsed: 0.002 s - in org.jmock.test.unit.internal.ChangeStateSideEffectTests
 [INFO] Running org.jmock.test.unit.internal.ProxiedObjectIdentityTests
 [INFO] Tests run: 5, Failures: 0, Errors: 0, Skipped: 0, Time elapsed: 0 s - in org.jmock.test.unit.internal.ProxiedObjectIdentityTests
 [INFO] Running org.jmock.test.unit.internal.AllDeclaredFieldsTests
-[INFO] Tests run: 3, Failures: 0, Errors: 0, Skipped: 0, Time elapsed: 0 s - in org.jmock.test.unit.internal.AllDeclaredFieldsTests
+[INFO] Tests run: 3, Failures: 0, Errors: 0, Skipped: 0, Time elapsed: 0.005 s - in org.jmock.test.unit.internal.AllDeclaredFieldsTests
 [INFO] Running org.jmock.test.unit.internal.CardinalityTests
-[INFO] Tests run: 8, Failures: 0, Errors: 0, Skipped: 0, Time elapsed: 0 s - in org.jmock.test.unit.internal.CardinalityTests
+[INFO] Tests run: 8, Failures: 0, Errors: 0, Skipped: 0, Time elapsed: 0.001 s - in org.jmock.test.unit.internal.CardinalityTests
 [INFO] Running org.jmock.test.unit.internal.InStateOrderingConstraintTests
 [INFO] Tests run: 2, Failures: 0, Errors: 0, Skipped: 0, Time elapsed: 0 s - in org.jmock.test.unit.internal.InStateOrderingConstraintTests
 [INFO] Running org.jmock.test.unit.internal.InvocationExpectationTests
-[INFO] Tests run: 15, Failures: 0, Errors: 0, Skipped: 0, Time elapsed: 0.031 s - in org.jmock.test.unit.internal.InvocationExpectationTests
+[INFO] Tests run: 15, Failures: 0, Errors: 0, Skipped: 0, Time elapsed: 0.006 s - in org.jmock.test.unit.internal.InvocationExpectationTests
 [INFO] Running org.jmock.test.unit.internal.InvocationDiverterTests
-[INFO] Tests run: 3, Failures: 0, Errors: 0, Skipped: 0, Time elapsed: 0 s - in org.jmock.test.unit.internal.InvocationDiverterTests
+[INFO] Tests run: 3, Failures: 0, Errors: 0, Skipped: 0, Time elapsed: 0.001 s - in org.jmock.test.unit.internal.InvocationDiverterTests
 [INFO] Running org.jmock.test.unit.internal.FormattingTests
-[INFO] Tests run: 1, Failures: 0, Errors: 0, Skipped: 0, Time elapsed: 0 s - in org.jmock.test.unit.internal.FormattingTests
+[INFO] Tests run: 1, Failures: 0, Errors: 0, Skipped: 0, Time elapsed: 0.001 s - in org.jmock.test.unit.internal.FormattingTests
 [INFO] Running org.jmock.test.unit.internal.ReturnDefaultCollectionTests
-[INFO] Tests run: 8, Failures: 0, Errors: 0, Skipped: 0, Time elapsed: 0.154 s - in org.jmock.test.unit.internal.ReturnDefaultCollectionTests
+[INFO] Tests run: 8, Failures: 0, Errors: 0, Skipped: 0, Time elapsed: 0.134 s - in org.jmock.test.unit.internal.ReturnDefaultCollectionTests
 [INFO] Running org.jmock.test.unit.internal.ReturnDefaultValueActionTests
-[INFO] Tests run: 7, Failures: 0, Errors: 0, Skipped: 0, Time elapsed: 0.008 s - in org.jmock.test.unit.internal.ReturnDefaultValueActionTests
+[INFO] Tests run: 7, Failures: 0, Errors: 0, Skipped: 0, Time elapsed: 0.01 s - in org.jmock.test.unit.internal.ReturnDefaultValueActionTests
 [INFO] Running org.jmock.test.unit.internal.InvocationDispatcherTests
-[INFO] Tests run: 4, Failures: 0, Errors: 0, Skipped: 0, Time elapsed: 0.003 s - in org.jmock.test.unit.internal.InvocationDispatcherTests
+[INFO] Tests run: 4, Failures: 0, Errors: 0, Skipped: 0, Time elapsed: 0.005 s - in org.jmock.test.unit.internal.InvocationDispatcherTests
 [INFO] 
 [INFO] Results:
 [INFO] 
@@ -3244,9 +3278,9 @@
 [INFO]  T E S T S
 [INFO] -------------------------------------------------------
 [INFO] Running org.jmock.test.unit.integration.junit3.VerifyingTestCaseTests
-[INFO] Tests run: 6, Failures: 0, Errors: 0, Skipped: 0, Time elapsed: 0.043 s - in org.jmock.test.unit.integration.junit3.VerifyingTestCaseTests
+[INFO] Tests run: 6, Failures: 0, Errors: 0, Skipped: 0, Time elapsed: 0.021 s - in org.jmock.test.unit.integration.junit3.VerifyingTestCaseTests
 [INFO] Running org.jmock.test.unit.integration.junit3.MockObjectTestCaseTests
-[INFO] Tests run: 1, Failures: 0, Errors: 0, Skipped: 0, Time elapsed: 0.018 s - in org.jmock.test.unit.integration.junit3.MockObjectTestCaseTests
+[INFO] Tests run: 1, Failures: 0, Errors: 0, Skipped: 0, Time elapsed: 0.008 s - in org.jmock.test.unit.integration.junit3.MockObjectTestCaseTests
 [INFO] 
 [INFO] Results:
 [INFO] 
@@ -3277,11 +3311,11 @@
 [INFO]  T E S T S
 [INFO] -------------------------------------------------------
 [INFO] Running org.jmock.test.acceptance.junit4.JUnit4WithRulesTestRunnerTests
-[INFO] Tests run: 6, Failures: 0, Errors: 0, Skipped: 0, Time elapsed: 0.376 s - in org.jmock.test.acceptance.junit4.JUnit4WithRulesTestRunnerTests
+[INFO] Tests run: 6, Failures: 0, Errors: 0, Skipped: 0, Time elapsed: 0.136 s - in org.jmock.test.acceptance.junit4.JUnit4WithRulesTestRunnerTests
 [INFO] Running org.jmock.test.acceptance.junit4.JUnit4TestRunnerTests
-[INFO] Tests run: 9, Failures: 0, Errors: 0, Skipped: 0, Time elapsed: 0.106 s - in org.jmock.test.acceptance.junit4.JUnit4TestRunnerTests
+[INFO] Tests run: 9, Failures: 0, Errors: 0, Skipped: 0, Time elapsed: 0.038 s - in org.jmock.test.acceptance.junit4.JUnit4TestRunnerTests
 [INFO] Running org.jmock.test.unit.lib.concurrent.internal.SynchroniserTests
-Exception in thread "pool-4-thread-6" Exception in thread "pool-4-thread-9" java.lang.AssertionError: unexpected invocation: mockObject.action()
+Exception in thread "pool-4-thread-1" java.lang.AssertionError: unexpected invocation: mockObject.action()
 expectations:
   expected once, never invoked: mockObject.finished(); then threads is finished
 states:
@@ -3304,7 +3338,7 @@
 	at java.base/java.util.concurrent.ThreadPoolExecutor.runWorker(ThreadPoolExecutor.java:1128)
 	at java.base/java.util.concurrent.ThreadPoolExecutor$Worker.run(ThreadPoolExecutor.java:628)
 	at java.base/java.lang.Thread.run(Thread.java:834)
-Exception in thread "pool-4-thread-3" java.lang.AssertionError: unexpected invocation: mockObject.action()
+Exception in thread "pool-4-thread-4" Exception in thread "pool-4-thread-6" Exception in thread "pool-4-thread-5" Exception in thread "pool-4-thread-3" java.lang.AssertionError: unexpected invocation: mockObject.action()
 expectations:
   expected once, never invoked: mockObject.finished(); then threads is finished
 states:
@@ -3327,7 +3361,7 @@
 	at java.base/java.util.concurrent.ThreadPoolExecutor.runWorker(ThreadPoolExecutor.java:1128)
 	at java.base/java.util.concurrent.ThreadPoolExecutor$Worker.run(ThreadPoolExecutor.java:628)
 	at java.base/java.lang.Thread.run(Thread.java:834)
-Exception in thread "pool-4-thread-4" java.lang.AssertionError: unexpected invocation: mockObject.action()
+Exception in thread "pool-4-thread-9" java.lang.AssertionError: unexpected invocation: mockObject.action()
 expectations:
   expected once, never invoked: mockObject.finished(); then threads is finished
 states:
@@ -3373,7 +3407,7 @@
 	at java.base/java.util.concurrent.ThreadPoolExecutor.runWorker(ThreadPoolExecutor.java:1128)
 	at java.base/java.util.concurrent.ThreadPoolExecutor$Worker.run(ThreadPoolExecutor.java:628)
 	at java.base/java.lang.Thread.run(Thread.java:834)
-Exception in thread "pool-4-thread-8" java.lang.AssertionError: unexpected invocation: mockObject.action()
+java.lang.AssertionError: unexpected invocation: mockObject.action()
 expectations:
   expected once, never invoked: mockObject.finished(); then threads is finished
 states:
@@ -3396,7 +3430,7 @@
 	at java.base/java.util.concurrent.ThreadPoolExecutor.runWorker(ThreadPoolExecutor.java:1128)
 	at java.base/java.util.concurrent.ThreadPoolExecutor$Worker.run(ThreadPoolExecutor.java:628)
 	at java.base/java.lang.Thread.run(Thread.java:834)
-Exception in thread "pool-4-thread-10" java.lang.AssertionError: unexpected invocation: mockObject.action()
+java.lang.AssertionError: unexpected invocation: mockObject.action()
 expectations:
   expected once, never invoked: mockObject.finished(); then threads is finished
 states:
@@ -3419,7 +3453,7 @@
 	at java.base/java.util.concurrent.ThreadPoolExecutor.runWorker(ThreadPoolExecutor.java:1128)
 	at java.base/java.util.concurrent.ThreadPoolExecutor$Worker.run(ThreadPoolExecutor.java:628)
 	at java.base/java.lang.Thread.run(Thread.java:834)
-Exception in thread "pool-4-thread-7" java.lang.AssertionError: unexpected invocation: mockObject.action()
+Exception in thread "pool-4-thread-7" Exception in thread "pool-4-thread-12" java.lang.AssertionError: unexpected invocation: mockObject.action()
 expectations:
   expected once, never invoked: mockObject.finished(); then threads is finished
 states:
@@ -3442,7 +3476,7 @@
 	at java.base/java.util.concurrent.ThreadPoolExecutor.runWorker(ThreadPoolExecutor.java:1128)
 	at java.base/java.util.concurrent.ThreadPoolExecutor$Worker.run(ThreadPoolExecutor.java:628)
 	at java.base/java.lang.Thread.run(Thread.java:834)
-Exception in thread "pool-4-thread-18" java.lang.AssertionError: unexpected invocation: mockObject.action()
+Exception in thread "pool-4-thread-8" Exception in thread "pool-4-thread-13" java.lang.AssertionError: unexpected invocation: mockObject.action()
 expectations:
   expected once, never invoked: mockObject.finished(); then threads is finished
 states:
@@ -3465,7 +3499,7 @@
 	at java.base/java.util.concurrent.ThreadPoolExecutor.runWorker(ThreadPoolExecutor.java:1128)
 	at java.base/java.util.concurrent.ThreadPoolExecutor$Worker.run(ThreadPoolExecutor.java:628)
 	at java.base/java.lang.Thread.run(Thread.java:834)
-Exception in thread "pool-4-thread-1" Exception in thread "pool-4-thread-17" java.lang.AssertionError: unexpected invocation: mockObject.action()
+Exception in thread "pool-4-thread-17" java.lang.AssertionError: unexpected invocation: mockObject.action()
 expectations:
   expected once, never invoked: mockObject.finished(); then threads is finished
 states:
@@ -3511,7 +3545,7 @@
 	at java.base/java.util.concurrent.ThreadPoolExecutor.runWorker(ThreadPoolExecutor.java:1128)
 	at java.base/java.util.concurrent.ThreadPoolExecutor$Worker.run(ThreadPoolExecutor.java:628)
 	at java.base/java.lang.Thread.run(Thread.java:834)
-Exception in thread "pool-4-thread-15" java.lang.AssertionError: unexpected invocation: mockObject.action()
+Exception in thread "pool-4-thread-14" java.lang.AssertionError: unexpected invocation: mockObject.action()
 expectations:
   expected once, never invoked: mockObject.finished(); then threads is finished
 states:
@@ -3534,7 +3568,7 @@
 	at java.base/java.util.concurrent.ThreadPoolExecutor.runWorker(ThreadPoolExecutor.java:1128)
 	at java.base/java.util.concurrent.ThreadPoolExecutor$Worker.run(ThreadPoolExecutor.java:628)
 	at java.base/java.lang.Thread.run(Thread.java:834)
-Exception in thread "pool-4-thread-14" java.lang.AssertionError: unexpected invocation: mockObject.action()
+Exception in thread "pool-4-thread-10" Exception in thread "pool-4-thread-11" java.lang.AssertionError: unexpected invocation: mockObject.action()
 expectations:
   expected once, never invoked: mockObject.finished(); then threads is finished
 states:
@@ -3557,7 +3591,7 @@
 	at java.base/java.util.concurrent.ThreadPoolExecutor.runWorker(ThreadPoolExecutor.java:1128)
 	at java.base/java.util.concurrent.ThreadPoolExecutor$Worker.run(ThreadPoolExecutor.java:628)
 	at java.base/java.lang.Thread.run(Thread.java:834)
-Exception in thread "pool-4-thread-13" java.lang.AssertionError: unexpected invocation: mockObject.action()
+Exception in thread "pool-4-thread-2" java.lang.AssertionError: unexpected invocation: mockObject.action()
 expectations:
   expected once, never invoked: mockObject.finished(); then threads is finished
 states:
@@ -3580,7 +3614,7 @@
 	at java.base/java.util.concurrent.ThreadPoolExecutor.runWorker(ThreadPoolExecutor.java:1128)
 	at java.base/java.util.concurrent.ThreadPoolExecutor$Worker.run(ThreadPoolExecutor.java:628)
 	at java.base/java.lang.Thread.run(Thread.java:834)
-Exception in thread "pool-4-thread-5" java.lang.AssertionError: unexpected invocation: mockObject.action()
+java.lang.AssertionError: unexpected invocation: mockObject.action()
 expectations:
   expected once, never invoked: mockObject.finished(); then threads is finished
 states:
@@ -3603,7 +3637,7 @@
 	at java.base/java.util.concurrent.ThreadPoolExecutor.runWorker(ThreadPoolExecutor.java:1128)
 	at java.base/java.util.concurrent.ThreadPoolExecutor$Worker.run(ThreadPoolExecutor.java:628)
 	at java.base/java.lang.Thread.run(Thread.java:834)
-Exception in thread "pool-4-thread-2" java.lang.AssertionError: unexpected invocation: mockObject.action()
+java.lang.AssertionError: unexpected invocation: mockObject.action()
 expectations:
   expected once, never invoked: mockObject.finished(); then threads is finished
 states:
@@ -3649,7 +3683,7 @@
 	at java.base/java.util.concurrent.ThreadPoolExecutor.runWorker(ThreadPoolExecutor.java:1128)
 	at java.base/java.util.concurrent.ThreadPoolExecutor$Worker.run(ThreadPoolExecutor.java:628)
 	at java.base/java.lang.Thread.run(Thread.java:834)
-Exception in thread "pool-6-thread-1" java.lang.AssertionError: unexpected invocation: mockObject.action()
+Exception in thread "pool-6-thread-3" Exception in thread "pool-6-thread-1" Exception in thread "pool-6-thread-2" java.lang.AssertionError: unexpected invocation: mockObject.action()
 no expectations specified: did you...
  - forget to start an expectation with a cardinality clause?
  - call a mocked method to specify the parameter of an expectation?
@@ -3671,7 +3705,7 @@
 	at java.base/java.util.concurrent.ThreadPoolExecutor.runWorker(ThreadPoolExecutor.java:1128)
 	at java.base/java.util.concurrent.ThreadPoolExecutor$Worker.run(ThreadPoolExecutor.java:628)
 	at java.base/java.lang.Thread.run(Thread.java:834)
-Exception in thread "pool-6-thread-3" java.lang.AssertionError: unexpected invocation: mockObject.action()
+Exception in thread "pool-6-thread-7" Exception in thread "pool-6-thread-6" java.lang.AssertionError: unexpected invocation: mockObject.action()
 no expectations specified: did you...
  - forget to start an expectation with a cardinality clause?
  - call a mocked method to specify the parameter of an expectation?
@@ -3693,7 +3727,7 @@
 	at java.base/java.util.concurrent.ThreadPoolExecutor.runWorker(ThreadPoolExecutor.java:1128)
 	at java.base/java.util.concurrent.ThreadPoolExecutor$Worker.run(ThreadPoolExecutor.java:628)
 	at java.base/java.lang.Thread.run(Thread.java:834)
-Exception in thread "pool-6-thread-4" java.lang.AssertionError: unexpected invocation: mockObject.action()
+Exception in thread "pool-6-thread-5" Exception in thread "pool-6-thread-4" java.lang.AssertionError: unexpected invocation: mockObject.action()
 no expectations specified: did you...
  - forget to start an expectation with a cardinality clause?
  - call a mocked method to specify the parameter of an expectation?
@@ -3715,7 +3749,7 @@
 	at java.base/java.util.concurrent.ThreadPoolExecutor.runWorker(ThreadPoolExecutor.java:1128)
 	at java.base/java.util.concurrent.ThreadPoolExecutor$Worker.run(ThreadPoolExecutor.java:628)
 	at java.base/java.lang.Thread.run(Thread.java:834)
-Exception in thread "pool-6-thread-6" java.lang.AssertionError: unexpected invocation: mockObject.action()
+java.lang.AssertionError: unexpected invocation: mockObject.action()
 no expectations specified: did you...
  - forget to start an expectation with a cardinality clause?
  - call a mocked method to specify the parameter of an expectation?
@@ -3737,7 +3771,7 @@
 	at java.base/java.util.concurrent.ThreadPoolExecutor.runWorker(ThreadPoolExecutor.java:1128)
 	at java.base/java.util.concurrent.ThreadPoolExecutor$Worker.run(ThreadPoolExecutor.java:628)
 	at java.base/java.lang.Thread.run(Thread.java:834)
-Exception in thread "pool-6-thread-7" java.lang.AssertionError: unexpected invocation: mockObject.action()
+Exception in thread "pool-6-thread-14" Exception in thread "pool-6-thread-11" java.lang.AssertionError: unexpected invocation: mockObject.action()
 no expectations specified: did you...
  - forget to start an expectation with a cardinality clause?
  - call a mocked method to specify the parameter of an expectation?
@@ -3759,7 +3793,7 @@
 	at java.base/java.util.concurrent.ThreadPoolExecutor.runWorker(ThreadPoolExecutor.java:1128)
 	at java.base/java.util.concurrent.ThreadPoolExecutor$Worker.run(ThreadPoolExecutor.java:628)
 	at java.base/java.lang.Thread.run(Thread.java:834)
-Exception in thread "pool-6-thread-2" java.lang.AssertionError: unexpected invocation: mockObject.action()
+java.lang.AssertionError: unexpected invocation: mockObject.action()
 no expectations specified: did you...
  - forget to start an expectation with a cardinality clause?
  - call a mocked method to specify the parameter of an expectation?
@@ -3781,7 +3815,7 @@
 	at java.base/java.util.concurrent.ThreadPoolExecutor.runWorker(ThreadPoolExecutor.java:1128)
 	at java.base/java.util.concurrent.ThreadPoolExecutor$Worker.run(ThreadPoolExecutor.java:628)
 	at java.base/java.lang.Thread.run(Thread.java:834)
-Exception in thread "pool-6-thread-5" java.lang.AssertionError: unexpected invocation: mockObject.action()
+Exception in thread "pool-6-thread-10" java.lang.AssertionError: unexpected invocation: mockObject.action()
 no expectations specified: did you...
  - forget to start an expectation with a cardinality clause?
  - call a mocked method to specify the parameter of an expectation?
@@ -3825,7 +3859,7 @@
 	at java.base/java.util.concurrent.ThreadPoolExecutor.runWorker(ThreadPoolExecutor.java:1128)
 	at java.base/java.util.concurrent.ThreadPoolExecutor$Worker.run(ThreadPoolExecutor.java:628)
 	at java.base/java.lang.Thread.run(Thread.java:834)
-Exception in thread "pool-6-thread-10" java.lang.AssertionError: unexpected invocation: mockObject.action()
+Exception in thread "pool-6-thread-8" java.lang.AssertionError: unexpected invocation: mockObject.action()
 no expectations specified: did you...
  - forget to start an expectation with a cardinality clause?
  - call a mocked method to specify the parameter of an expectation?
@@ -3847,7 +3881,7 @@
 	at java.base/java.util.concurrent.ThreadPoolExecutor.runWorker(ThreadPoolExecutor.java:1128)
 	at java.base/java.util.concurrent.ThreadPoolExecutor$Worker.run(ThreadPoolExecutor.java:628)
 	at java.base/java.lang.Thread.run(Thread.java:834)
-Exception in thread "pool-6-thread-13" java.lang.AssertionError: unexpected invocation: mockObject.action()
+java.lang.AssertionError: unexpected invocation: mockObject.action()
 no expectations specified: did you...
  - forget to start an expectation with a cardinality clause?
  - call a mocked method to specify the parameter of an expectation?
@@ -3869,7 +3903,7 @@
 	at java.base/java.util.concurrent.ThreadPoolExecutor.runWorker(ThreadPoolExecutor.java:1128)
 	at java.base/java.util.concurrent.ThreadPoolExecutor$Worker.run(ThreadPoolExecutor.java:628)
 	at java.base/java.lang.Thread.run(Thread.java:834)
-Exception in thread "pool-6-thread-11" java.lang.AssertionError: unexpected invocation: mockObject.action()
+Exception in thread "pool-6-thread-15" Exception in thread "pool-6-thread-16" Exception in thread "pool-6-thread-12" java.lang.AssertionError: unexpected invocation: mockObject.action()
 no expectations specified: did you...
  - forget to start an expectation with a cardinality clause?
  - call a mocked method to specify the parameter of an expectation?
@@ -3891,7 +3925,7 @@
 	at java.base/java.util.concurrent.ThreadPoolExecutor.runWorker(ThreadPoolExecutor.java:1128)
 	at java.base/java.util.concurrent.ThreadPoolExecutor$Worker.run(ThreadPoolExecutor.java:628)
 	at java.base/java.lang.Thread.run(Thread.java:834)
-Exception in thread "pool-6-thread-12" java.lang.AssertionError: unexpected invocation: mockObject.action()
+Exception in thread "pool-6-thread-13" java.lang.AssertionError: unexpected invocation: mockObject.action()
 no expectations specified: did you...
  - forget to start an expectation with a cardinality clause?
  - call a mocked method to specify the parameter of an expectation?
@@ -3913,7 +3947,7 @@
 	at java.base/java.util.concurrent.ThreadPoolExecutor.runWorker(ThreadPoolExecutor.java:1128)
 	at java.base/java.util.concurrent.ThreadPoolExecutor$Worker.run(ThreadPoolExecutor.java:628)
 	at java.base/java.lang.Thread.run(Thread.java:834)
-Exception in thread "pool-6-thread-19" java.lang.AssertionError: unexpected invocation: mockObject.action()
+java.lang.AssertionError: unexpected invocation: mockObject.action()
 no expectations specified: did you...
  - forget to start an expectation with a cardinality clause?
  - call a mocked method to specify the parameter of an expectation?
@@ -3935,7 +3969,7 @@
 	at java.base/java.util.concurrent.ThreadPoolExecutor.runWorker(ThreadPoolExecutor.java:1128)
 	at java.base/java.util.concurrent.ThreadPoolExecutor$Worker.run(ThreadPoolExecutor.java:628)
 	at java.base/java.lang.Thread.run(Thread.java:834)
-Exception in thread "pool-6-thread-17" java.lang.AssertionError: unexpected invocation: mockObject.action()
+java.lang.AssertionError: unexpected invocation: mockObject.action()
 no expectations specified: did you...
  - forget to start an expectation with a cardinality clause?
  - call a mocked method to specify the parameter of an expectation?
@@ -3957,7 +3991,7 @@
 	at java.base/java.util.concurrent.ThreadPoolExecutor.runWorker(ThreadPoolExecutor.java:1128)
 	at java.base/java.util.concurrent.ThreadPoolExecutor$Worker.run(ThreadPoolExecutor.java:628)
 	at java.base/java.lang.Thread.run(Thread.java:834)
-Exception in thread "pool-6-thread-14" java.lang.AssertionError: unexpected invocation: mockObject.action()
+java.lang.AssertionError: unexpected invocation: mockObject.action()
 no expectations specified: did you...
  - forget to start an expectation with a cardinality clause?
  - call a mocked method to specify the parameter of an expectation?
@@ -3979,7 +4013,7 @@
 	at java.base/java.util.concurrent.ThreadPoolExecutor.runWorker(ThreadPoolExecutor.java:1128)
 	at java.base/java.util.concurrent.ThreadPoolExecutor$Worker.run(ThreadPoolExecutor.java:628)
 	at java.base/java.lang.Thread.run(Thread.java:834)
-Exception in thread "pool-6-thread-8" java.lang.AssertionError: unexpected invocation: mockObject.action()
+java.lang.AssertionError: unexpected invocation: mockObject.action()
 no expectations specified: did you...
  - forget to start an expectation with a cardinality clause?
  - call a mocked method to specify the parameter of an expectation?
@@ -4001,7 +4035,7 @@
 	at java.base/java.util.concurrent.ThreadPoolExecutor.runWorker(ThreadPoolExecutor.java:1128)
 	at java.base/java.util.concurrent.ThreadPoolExecutor$Worker.run(ThreadPoolExecutor.java:628)
 	at java.base/java.lang.Thread.run(Thread.java:834)
-[INFO] Tests run: 6, Failures: 0, Errors: 0, Skipped: 0, Time elapsed: 1.351 s - in org.jmock.test.unit.lib.concurrent.internal.SynchroniserTests
+[INFO] Tests run: 6, Failures: 0, Errors: 0, Skipped: 0, Time elapsed: 0.42 s - in org.jmock.test.unit.lib.concurrent.internal.SynchroniserTests
 [INFO] 
 [INFO] Results:
 [INFO] 
@@ -4032,27 +4066,27 @@
 [INFO]  T E S T S
 [INFO] -------------------------------------------------------
 [INFO] Running org.jmock.test.unit.lib.legacy.Java8Issue79UnitTest
-[INFO] Tests run: 1, Failures: 0, Errors: 0, Skipped: 0, Time elapsed: 0.512 s - in org.jmock.test.unit.lib.legacy.Java8Issue79UnitTest
+[INFO] Tests run: 1, Failures: 0, Errors: 0, Skipped: 0, Time elapsed: 0.197 s - in org.jmock.test.unit.lib.legacy.Java8Issue79UnitTest
 [INFO] Running org.jmock.test.unit.lib.legacy.ClassImposteriserTests
-[INFO] Tests run: 8, Failures: 0, Errors: 0, Skipped: 0, Time elapsed: 0.158 s - in org.jmock.test.unit.lib.legacy.ClassImposteriserTests
+[INFO] Tests run: 8, Failures: 0, Errors: 0, Skipped: 0, Time elapsed: 0.044 s - in org.jmock.test.unit.lib.legacy.ClassImposteriserTests
 [INFO] Running org.jmock.test.acceptance.InvocationDescriptionAcceptanceTests
-[INFO] Tests run: 1, Failures: 0, Errors: 0, Skipped: 0, Time elapsed: 0.152 s - in org.jmock.test.acceptance.InvocationDescriptionAcceptanceTests
+[INFO] Tests run: 1, Failures: 0, Errors: 0, Skipped: 0, Time elapsed: 0.026 s - in org.jmock.test.acceptance.InvocationDescriptionAcceptanceTests
 [INFO] Running org.jmock.test.acceptance.FinalizerIsIgnoredAcceptanceTests
-[INFO] Tests run: 1, Failures: 0, Errors: 0, Skipped: 0, Time elapsed: 0.066 s - in org.jmock.test.acceptance.FinalizerIsIgnoredAcceptanceTests
+[INFO] Tests run: 1, Failures: 0, Errors: 0, Skipped: 0, Time elapsed: 0.013 s - in org.jmock.test.acceptance.FinalizerIsIgnoredAcceptanceTests
 [INFO] Running org.jmock.test.acceptance.MockingPackageProtectedTypeAcceptanceTests
-[INFO] Tests run: 3, Failures: 0, Errors: 0, Skipped: 0, Time elapsed: 0.02 s - in org.jmock.test.acceptance.MockingPackageProtectedTypeAcceptanceTests
+[INFO] Tests run: 3, Failures: 0, Errors: 0, Skipped: 0, Time elapsed: 0.013 s - in org.jmock.test.acceptance.MockingPackageProtectedTypeAcceptanceTests
 [INFO] Running org.jmock.test.acceptance.RedeclaredObjectMethodsAcceptanceTests
-[INFO] Tests run: 3, Failures: 0, Errors: 0, Skipped: 0, Time elapsed: 0.101 s - in org.jmock.test.acceptance.RedeclaredObjectMethodsAcceptanceTests
+[INFO] Tests run: 3, Failures: 0, Errors: 0, Skipped: 0, Time elapsed: 0.048 s - in org.jmock.test.acceptance.RedeclaredObjectMethodsAcceptanceTests
 [INFO] Running org.jmock.test.acceptance.MockingClassesAcceptanceTests
-[INFO] Tests run: 1, Failures: 0, Errors: 0, Skipped: 0, Time elapsed: 0.01 s - in org.jmock.test.acceptance.MockingClassesAcceptanceTests
+[INFO] Tests run: 1, Failures: 0, Errors: 0, Skipped: 0, Time elapsed: 0.009 s - in org.jmock.test.acceptance.MockingClassesAcceptanceTests
 [INFO] Running org.jmock.test.acceptance.MockeryFinalizationAcceptanceTests
 WARNING - a previous test left output in finalization [the Mockery is not thread-safe: use a Synchroniser to ensure thread safety
 ]
-[WARNING] Tests run: 5, Failures: 0, Errors: 0, Skipped: 2, Time elapsed: 1.997 s - in org.jmock.test.acceptance.MockeryFinalizationAcceptanceTests
+[WARNING] Tests run: 5, Failures: 0, Errors: 0, Skipped: 2, Time elapsed: 0.82 s - in org.jmock.test.acceptance.MockeryFinalizationAcceptanceTests
 [INFO] Running org.jmock.test.acceptance.MockingImplementationOfGenericTypeAcceptanceTests
-[INFO] Tests run: 3, Failures: 0, Errors: 0, Skipped: 0, Time elapsed: 0.051 s - in org.jmock.test.acceptance.MockingImplementationOfGenericTypeAcceptanceTests
+[INFO] Tests run: 3, Failures: 0, Errors: 0, Skipped: 0, Time elapsed: 0.023 s - in org.jmock.test.acceptance.MockingImplementationOfGenericTypeAcceptanceTests
 [INFO] Running org.jmock.test.acceptance.ClassLoaderAcceptanceTests
-[INFO] Tests run: 3, Failures: 0, Errors: 0, Skipped: 0, Time elapsed: 0.081 s - in org.jmock.test.acceptance.ClassLoaderAcceptanceTests
+[INFO] Tests run: 3, Failures: 0, Errors: 0, Skipped: 0, Time elapsed: 0.014 s - in org.jmock.test.acceptance.ClassLoaderAcceptanceTests
 [INFO] 
 [INFO] Results:
 [INFO] 
@@ -4061,17 +4095,17 @@
 [INFO] ------------------------------------------------------------------------
 [INFO] Reactor Summary for jMock 2 Parent 2.8.4:
 [INFO] 
-[INFO] jMock 2 Parent ..................................... SUCCESS [  0.068 s]
-[INFO] jMock 2 Test Jar ................................... SUCCESS [  1.405 s]
-[INFO] jMock 2 Core ....................................... SUCCESS [ 11.511 s]
-[INFO] jmock-junit3 ....................................... SUCCESS [ 10.181 s]
-[INFO] jmock-junit4 ....................................... SUCCESS [ 10.222 s]
-[INFO] jmock-legacy ....................................... SUCCESS [ 10.177 s]
+[INFO] jMock 2 Parent ..................................... SUCCESS [  0.070 s]
+[INFO] jMock 2 Test Jar ................................... SUCCESS [  0.882 s]
+[INFO] jMock 2 Core ....................................... SUCCESS [ 10.776 s]
+[INFO] jmock-junit3 ....................................... SUCCESS [ 10.086 s]
+[INFO] jmock-junit4 ....................................... SUCCESS [ 10.077 s]
+[INFO] jmock-legacy ....................................... SUCCESS [ 10.070 s]
 [INFO] ------------------------------------------------------------------------
 [INFO] BUILD SUCCESS
 [INFO] ------------------------------------------------------------------------
-[INFO] Total time:  43.983 s
-[INFO] Finished at: 2022-03-23T06:17:17-12:00
+[INFO] Total time:  42.217 s
+[INFO] Finished at: 2021-02-19T01:59:29+14:00
 [INFO] ------------------------------------------------------------------------
    create-stamp debian/debhelper-build-stamp
  fakeroot debian/rules binary
@@ -4174,17 +4208,17 @@
 [INFO] ------------------------------------------------------------------------
 [INFO] Reactor Summary for jMock 2 Parent 2.8.4:
 [INFO] 
-[INFO] jMock 2 Parent ..................................... SUCCESS [  1.281 s]
-[INFO] jMock 2 Test Jar ................................... SUCCESS [  0.166 s]
-[INFO] jMock 2 Core ....................................... SUCCESS [  0.305 s]
-[INFO] jmock-junit3 ....................................... SUCCESS [  0.168 s]
-[INFO] jmock-junit4 ....................................... SUCCESS [  0.128 s]
-[INFO] jmock-legacy ....................................... SUCCESS [  0.116 s]
+[INFO] jMock 2 Parent ..................................... SUCCESS [  0.773 s]
+[INFO] jMock 2 Test Jar ................................... SUCCESS [  0.096 s]
+[INFO] jMock 2 Core ....................................... SUCCESS [  0.090 s]
+[INFO] jmock-junit3 ....................................... SUCCESS [  0.088 s]
+[INFO] jmock-junit4 ....................................... SUCCESS [  0.064 s]
+[INFO] jmock-legacy ....................................... SUCCESS [  0.072 s]
 [INFO] ------------------------------------------------------------------------
 [INFO] BUILD SUCCESS
 [INFO] ------------------------------------------------------------------------
-[INFO] Total time:  3.238 s
-[INFO] Finished at: 2022-03-23T06:17:29-12:00
+[INFO] Total time:  1.574 s
+[INFO] Finished at: 2021-02-19T01:59:33+14:00
 [INFO] ------------------------------------------------------------------------
 	mh_resolve_dependencies --non-interactive --offline --build -plibjmock2-java --javadoc --base-directory=/build/jmock2-2.8.4 --non-explore
 Analysing pom.xml...
@@ -4279,20 +4313,22 @@
 dpkg-gencontrol: warning: package libjmock2-java-doc: substitution variable ${maven:DocDepends} unused, but is defined
    dh_md5sums
    dh_builddeb
-dpkg-deb: building package 'libjmock2-java' in '../libjmock2-java_2.8.4-1_all.deb'.
 dpkg-deb: building package 'libjmock2-java-doc' in '../libjmock2-java-doc_2.8.4-1_all.deb'.
+dpkg-deb: building package 'libjmock2-java' in '../libjmock2-java_2.8.4-1_all.deb'.
  dpkg-genbuildinfo --build=binary
  dpkg-genchanges --build=binary >../jmock2_2.8.4-1_amd64.changes
 dpkg-genchanges: info: binary-only upload (no source code included)
  dpkg-source --after-build .
 dpkg-buildpackage: info: binary-only upload (no source included)
 I: copying local configuration
+I: user script /srv/workspace/pbuilder/41345/tmp/hooks/B01_cleanup starting
+I: user script /srv/workspace/pbuilder/41345/tmp/hooks/B01_cleanup finished
 I: unmounting dev/ptmx filesystem
 I: unmounting dev/pts filesystem
 I: unmounting dev/shm filesystem
 I: unmounting proc filesystem
 I: unmounting sys filesystem
 I: cleaning the build env 
-I: removing directory /srv/workspace/pbuilder/11186 and its subdirectories
-I: Current time: Wed Mar 23 06:19:42 -12 2022
-I: pbuilder-time-stamp: 1648059582
+I: removing directory /srv/workspace/pbuilder/41345 and its subdirectories
+I: Current time: Fri Feb 19 02:01:23 +14 2021
+I: pbuilder-time-stamp: 1613649683