Diff of the two buildlogs:

--
--- b1/build.log	2021-12-10 12:41:12.270560422 +0000
+++ b2/build.log	2021-12-10 17:20:49.095863668 +0000
@@ -1,6 +1,6 @@
 I: pbuilder: network access will be disabled during build
-I: Current time: Thu Dec  9 20:18:35 -12 2021
-I: pbuilder-time-stamp: 1639124315
+I: Current time: Fri Jan 13 09:04:15 +14 2023
+I: pbuilder-time-stamp: 1673550255
 I: Building the build Environment
 I: extracting base tarball [/var/cache/pbuilder/buster-reproducible-base.tgz]
 I: copying local configuration
@@ -17,7 +17,7 @@
 I: Extracting source
 gpgv: unknown type of key resource 'trustedkeys.kbx'
 gpgv: keyblock resource '/root/.gnupg/trustedkeys.kbx': General error
-gpgv: Signature made Sun Jan  6 17:51:37 2019 -12
+gpgv: Signature made Mon Jan  7 19:51:37 2019 +14
 gpgv:                using RSA key 638BC75EC1E5C589067E35DE62645EB35F686A8A
 gpgv: Can't check signature: No public key
 dpkg-source: warning: failed to verify signature on ./numba_0.42.0-1.dsc
@@ -29,136 +29,170 @@
 dpkg-source: info: applying sphinx-rtd-theme.patch
 I: using fakeroot in build.
 I: Installing the build-deps
-I: user script /srv/workspace/pbuilder/319807/tmp/hooks/D02_print_environment starting
+I: user script /srv/workspace/pbuilder/1325705/tmp/hooks/D01_modify_environment starting
+debug: Running on ionos5-amd64.
+I: Changing host+domainname to test build reproducibility
+I: Adding a custom variable just for the fun of it...
+I: Changing /bin/sh to bash
+Removing 'diversion of /bin/sh to /bin/sh.distrib by dash'
+Adding 'diversion of /bin/sh to /bin/sh.distrib by bash'
+Removing 'diversion of /usr/share/man/man1/sh.1.gz to /usr/share/man/man1/sh.distrib.1.gz by dash'
+Adding 'diversion of /usr/share/man/man1/sh.1.gz to /usr/share/man/man1/sh.distrib.1.gz by bash'
+I: Setting pbuilder2's login shell to /bin/bash
+I: Setting pbuilder2's GECOS to second user,second room,second work-phone,second home-phone,second other
+I: user script /srv/workspace/pbuilder/1325705/tmp/hooks/D01_modify_environment finished
+I: user script /srv/workspace/pbuilder/1325705/tmp/hooks/D02_print_environment starting
 I: set
-  BUILDDIR='/build'
-  BUILDUSERGECOS='first user,first room,first work-phone,first home-phone,first other'
-  BUILDUSERNAME='pbuilder1'
-  BUILD_ARCH='amd64'
-  DEBIAN_FRONTEND='noninteractive'
-  DEB_BUILD_OPTIONS='buildinfo=+all reproducible=+all parallel=15'
-  DISTRIBUTION=''
-  HOME='/root'
-  HOST_ARCH='amd64'
+  BASH=/bin/sh
+  BASHOPTS=checkwinsize:cmdhist:complete_fullquote:extquote:force_fignore:globasciiranges:hostcomplete:interactive_comments:progcomp:promptvars:sourcepath
+  BASH_ALIASES=()
+  BASH_ARGC=()
+  BASH_ARGV=()
+  BASH_CMDS=()
+  BASH_LINENO=([0]="12" [1]="0")
+  BASH_SOURCE=([0]="/tmp/hooks/D02_print_environment" [1]="/tmp/hooks/D02_print_environment")
+  BASH_VERSINFO=([0]="5" [1]="0" [2]="3" [3]="1" [4]="release" [5]="x86_64-pc-linux-gnu")
+  BASH_VERSION='5.0.3(1)-release'
+  BUILDDIR=/build
+  BUILDUSERGECOS='second user,second room,second work-phone,second home-phone,second other'
+  BUILDUSERNAME=pbuilder2
+  BUILD_ARCH=amd64
+  DEBIAN_FRONTEND=noninteractive
+  DEB_BUILD_OPTIONS='buildinfo=+all reproducible=+all parallel=16'
+  DIRSTACK=()
+  DISTRIBUTION=
+  EUID=0
+  FUNCNAME=([0]="Echo" [1]="main")
+  GROUPS=()
+  HOME=/root
+  HOSTNAME=i-capture-the-hostname
+  HOSTTYPE=x86_64
+  HOST_ARCH=amd64
   IFS=' 	
   '
-  INVOCATION_ID='c439052c6501492d847960ef3d7970c9'
-  LANG='C'
-  LANGUAGE='en_US:en'
-  LC_ALL='C'
-  MAIL='/var/mail/root'
-  OPTIND='1'
-  PATH='/usr/sbin:/usr/bin:/sbin:/bin:/usr/games'
-  PBCURRENTCOMMANDLINEOPERATION='build'
-  PBUILDER_OPERATION='build'
-  PBUILDER_PKGDATADIR='/usr/share/pbuilder'
-  PBUILDER_PKGLIBDIR='/usr/lib/pbuilder'
-  PBUILDER_SYSCONFDIR='/etc'
-  PPID='319807'
-  PS1='# '
-  PS2='> '
+  INVOCATION_ID=00241ab3598d42ce8860b9f37b1d6c28
+  LANG=C
+  LANGUAGE=et_EE:et
+  LC_ALL=C
+  MACHTYPE=x86_64-pc-linux-gnu
+  MAIL=/var/mail/root
+  OPTERR=1
+  OPTIND=1
+  OSTYPE=linux-gnu
+  PATH=/usr/sbin:/usr/bin:/sbin:/bin:/usr/games:/i/capture/the/path
+  PBCURRENTCOMMANDLINEOPERATION=build
+  PBUILDER_OPERATION=build
+  PBUILDER_PKGDATADIR=/usr/share/pbuilder
+  PBUILDER_PKGLIBDIR=/usr/lib/pbuilder
+  PBUILDER_SYSCONFDIR=/etc
+  PIPESTATUS=([0]="0")
+  POSIXLY_CORRECT=y
+  PPID=1325705
   PS4='+ '
-  PWD='/'
-  SHELL='/bin/bash'
-  SHLVL='2'
-  SUDO_COMMAND='/usr/bin/timeout -k 18.1h 18h /usr/bin/ionice -c 3 /usr/bin/nice /usr/sbin/pbuilder --build --configfile /srv/reproducible-results/rbuild-debian/tmp.2rZ6wFAUIc/pbuilderrc_nw45 --hookdir /etc/pbuilder/first-build-hooks --debbuildopts -b --basetgz /var/cache/pbuilder/buster-reproducible-base.tgz --buildresult /srv/reproducible-results/rbuild-debian/tmp.2rZ6wFAUIc/b1 --logfile b1/build.log numba_0.42.0-1.dsc'
-  SUDO_GID='110'
-  SUDO_UID='105'
-  SUDO_USER='jenkins'
-  TERM='unknown'
-  TZ='/usr/share/zoneinfo/Etc/GMT+12'
-  USER='root'
-  _='/usr/bin/systemd-run'
-  http_proxy='http://78.137.99.97:3128'
+  PWD=/
+  SHELL=/bin/bash
+  SHELLOPTS=braceexpand:errexit:hashall:interactive-comments:posix
+  SHLVL=3
+  SUDO_COMMAND='/usr/bin/timeout -k 24.1h 24h /usr/bin/ionice -c 3 /usr/bin/nice -n 11 /usr/bin/unshare --uts -- /usr/sbin/pbuilder --build --configfile /srv/reproducible-results/rbuild-debian/tmp.2rZ6wFAUIc/pbuilderrc_yvwD --hookdir /etc/pbuilder/rebuild-hooks --debbuildopts -b --basetgz /var/cache/pbuilder/buster-reproducible-base.tgz --buildresult /srv/reproducible-results/rbuild-debian/tmp.2rZ6wFAUIc/b2 --logfile b2/build.log numba_0.42.0-1.dsc'
+  SUDO_GID=110
+  SUDO_UID=105
+  SUDO_USER=jenkins
+  TERM=unknown
+  TZ=/usr/share/zoneinfo/Etc/GMT-14
+  UID=0
+  USER=root
+  _='I: set'
+  http_proxy=http://85.184.249.68:3128
 I: uname -a
-  Linux ionos1-amd64 5.10.0-9-amd64 #1 SMP Debian 5.10.70-1 (2021-09-30) x86_64 GNU/Linux
+  Linux i-capture-the-hostname 5.14.0-0.bpo.2-amd64 #1 SMP Debian 5.14.9-2~bpo11+1 (2021-10-10) x86_64 GNU/Linux
 I: ls -l /bin
   total 5116
-  -rwxr-xr-x 1 root root 1168776 Apr 17  2019 bash
-  -rwxr-xr-x 3 root root   38984 Jul 10  2019 bunzip2
-  -rwxr-xr-x 3 root root   38984 Jul 10  2019 bzcat
-  lrwxrwxrwx 1 root root       6 Jul 10  2019 bzcmp -> bzdiff
-  -rwxr-xr-x 1 root root    2227 Jul 10  2019 bzdiff
-  lrwxrwxrwx 1 root root       6 Jul 10  2019 bzegrep -> bzgrep
-  -rwxr-xr-x 1 root root    4877 Jun 24  2019 bzexe
-  lrwxrwxrwx 1 root root       6 Jul 10  2019 bzfgrep -> bzgrep
-  -rwxr-xr-x 1 root root    3641 Jul 10  2019 bzgrep
-  -rwxr-xr-x 3 root root   38984 Jul 10  2019 bzip2
-  -rwxr-xr-x 1 root root   14328 Jul 10  2019 bzip2recover
-  lrwxrwxrwx 1 root root       6 Jul 10  2019 bzless -> bzmore
-  -rwxr-xr-x 1 root root    1297 Jul 10  2019 bzmore
-  -rwxr-xr-x 1 root root   43744 Feb 28  2019 cat
-  -rwxr-xr-x 1 root root   64320 Feb 28  2019 chgrp
-  -rwxr-xr-x 1 root root   64288 Feb 28  2019 chmod
-  -rwxr-xr-x 1 root root   72512 Feb 28  2019 chown
-  -rwxr-xr-x 1 root root  146880 Feb 28  2019 cp
-  -rwxr-xr-x 1 root root  121464 Jan 17  2019 dash
-  -rwxr-xr-x 1 root root  109408 Feb 28  2019 date
-  -rwxr-xr-x 1 root root   76712 Feb 28  2019 dd
-  -rwxr-xr-x 1 root root   93744 Feb 28  2019 df
-  -rwxr-xr-x 1 root root  138856 Feb 28  2019 dir
-  -rwxr-xr-x 1 root root   84288 Jan  9  2019 dmesg
-  lrwxrwxrwx 1 root root       8 Sep 26  2018 dnsdomainname -> hostname
-  lrwxrwxrwx 1 root root       8 Sep 26  2018 domainname -> hostname
-  -rwxr-xr-x 1 root root   39520 Feb 28  2019 echo
-  -rwxr-xr-x 1 root root      28 Jan  7  2019 egrep
-  -rwxr-xr-x 1 root root   35424 Feb 28  2019 false
-  -rwxr-xr-x 1 root root      28 Jan  7  2019 fgrep
-  -rwxr-xr-x 1 root root   68880 Jan  9  2019 findmnt
-  -rwsr-xr-x 1 root root   34896 Apr 22  2020 fusermount
-  -rwxr-xr-x 1 root root  198976 Jan  7  2019 grep
-  -rwxr-xr-x 2 root root    2345 Jan  5  2019 gunzip
-  -rwxr-xr-x 1 root root    6375 Jan  5  2019 gzexe
-  -rwxr-xr-x 1 root root   98048 Jan  5  2019 gzip
-  -rwxr-xr-x 1 root root   26696 Sep 26  2018 hostname
-  -rwxr-xr-x 1 root root   68552 Feb 28  2019 ln
-  -rwxr-xr-x 1 root root   56760 Jul 26  2018 login
-  -rwxr-xr-x 1 root root  138856 Feb 28  2019 ls
-  -rwxr-xr-x 1 root root  108624 Jan  9  2019 lsblk
-  -rwxr-xr-x 1 root root   89088 Feb 28  2019 mkdir
-  -rwxr-xr-x 1 root root   68544 Feb 28  2019 mknod
-  -rwxr-xr-x 1 root root   43808 Feb 28  2019 mktemp
-  -rwxr-xr-x 1 root root   43008 Jan  9  2019 more
-  -rwsr-xr-x 1 root root   51280 Jan  9  2019 mount
-  -rwxr-xr-x 1 root root   14408 Jan  9  2019 mountpoint
-  -rwxr-xr-x 1 root root  138728 Feb 28  2019 mv
-  lrwxrwxrwx 1 root root       8 Sep 26  2018 nisdomainname -> hostname
-  lrwxrwxrwx 1 root root      14 Feb 14  2019 pidof -> /sbin/killall5
-  -rwxr-xr-x 1 root root   39616 Feb 28  2019 pwd
-  lrwxrwxrwx 1 root root       4 Apr 17  2019 rbash -> bash
-  -rwxr-xr-x 1 root root   47776 Feb 28  2019 readlink
-  -rwxr-xr-x 1 root root   68416 Feb 28  2019 rm
-  -rwxr-xr-x 1 root root   47776 Feb 28  2019 rmdir
-  -rwxr-xr-x 1 root root   23312 Jan 21  2019 run-parts
-  -rwxr-xr-x 1 root root  122224 Dec 22  2018 sed
-  lrwxrwxrwx 1 root root       4 Nov  7 09:58 sh -> dash
-  -rwxr-xr-x 1 root root   39552 Feb 28  2019 sleep
-  -rwxr-xr-x 1 root root   80672 Feb 28  2019 stty
-  -rwsr-xr-x 1 root root   63568 Jan  9  2019 su
-  -rwxr-xr-x 1 root root   35488 Feb 28  2019 sync
-  -rwxr-xr-x 1 root root  445560 Apr 23  2019 tar
-  -rwxr-xr-x 1 root root   14440 Jan 21  2019 tempfile
-  -rwxr-xr-x 1 root root   97152 Feb 28  2019 touch
-  -rwxr-xr-x 1 root root   35424 Feb 28  2019 true
-  -rwxr-xr-x 1 root root   14328 Apr 22  2020 ulockmgr_server
-  -rwsr-xr-x 1 root root   34888 Jan  9  2019 umount
-  -rwxr-xr-x 1 root root   39584 Feb 28  2019 uname
-  -rwxr-xr-x 2 root root    2345 Jan  5  2019 uncompress
-  -rwxr-xr-x 1 root root  138856 Feb 28  2019 vdir
-  -rwxr-xr-x 1 root root   34896 Jan  9  2019 wdctl
-  -rwxr-xr-x 1 root root     946 Jan 21  2019 which
-  lrwxrwxrwx 1 root root       8 Sep 26  2018 ypdomainname -> hostname
-  -rwxr-xr-x 1 root root    1983 Jan  5  2019 zcat
-  -rwxr-xr-x 1 root root    1677 Jan  5  2019 zcmp
-  -rwxr-xr-x 1 root root    5879 Jan  5  2019 zdiff
-  -rwxr-xr-x 1 root root      29 Jan  5  2019 zegrep
-  -rwxr-xr-x 1 root root      29 Jan  5  2019 zfgrep
-  -rwxr-xr-x 1 root root    2080 Jan  5  2019 zforce
-  -rwxr-xr-x 1 root root    7584 Jan  5  2019 zgrep
-  -rwxr-xr-x 1 root root    2205 Jan  5  2019 zless
-  -rwxr-xr-x 1 root root    1841 Jan  5  2019 zmore
-  -rwxr-xr-x 1 root root    4552 Jan  5  2019 znew
-I: user script /srv/workspace/pbuilder/319807/tmp/hooks/D02_print_environment finished
+  -rwxr-xr-x 1 root root 1168776 Apr 18  2019 bash
+  -rwxr-xr-x 3 root root   38984 Jul 11  2019 bunzip2
+  -rwxr-xr-x 3 root root   38984 Jul 11  2019 bzcat
+  lrwxrwxrwx 1 root root       6 Jul 11  2019 bzcmp -> bzdiff
+  -rwxr-xr-x 1 root root    2227 Jul 11  2019 bzdiff
+  lrwxrwxrwx 1 root root       6 Jul 11  2019 bzegrep -> bzgrep
+  -rwxr-xr-x 1 root root    4877 Jun 25  2019 bzexe
+  lrwxrwxrwx 1 root root       6 Jul 11  2019 bzfgrep -> bzgrep
+  -rwxr-xr-x 1 root root    3641 Jul 11  2019 bzgrep
+  -rwxr-xr-x 3 root root   38984 Jul 11  2019 bzip2
+  -rwxr-xr-x 1 root root   14328 Jul 11  2019 bzip2recover
+  lrwxrwxrwx 1 root root       6 Jul 11  2019 bzless -> bzmore
+  -rwxr-xr-x 1 root root    1297 Jul 11  2019 bzmore
+  -rwxr-xr-x 1 root root   43744 Mar  1  2019 cat
+  -rwxr-xr-x 1 root root   64320 Mar  1  2019 chgrp
+  -rwxr-xr-x 1 root root   64288 Mar  1  2019 chmod
+  -rwxr-xr-x 1 root root   72512 Mar  1  2019 chown
+  -rwxr-xr-x 1 root root  146880 Mar  1  2019 cp
+  -rwxr-xr-x 1 root root  121464 Jan 18  2019 dash
+  -rwxr-xr-x 1 root root  109408 Mar  1  2019 date
+  -rwxr-xr-x 1 root root   76712 Mar  1  2019 dd
+  -rwxr-xr-x 1 root root   93744 Mar  1  2019 df
+  -rwxr-xr-x 1 root root  138856 Mar  1  2019 dir
+  -rwxr-xr-x 1 root root   84288 Jan 10  2019 dmesg
+  lrwxrwxrwx 1 root root       8 Sep 27  2018 dnsdomainname -> hostname
+  lrwxrwxrwx 1 root root       8 Sep 27  2018 domainname -> hostname
+  -rwxr-xr-x 1 root root   39520 Mar  1  2019 echo
+  -rwxr-xr-x 1 root root      28 Jan  8  2019 egrep
+  -rwxr-xr-x 1 root root   35424 Mar  1  2019 false
+  -rwxr-xr-x 1 root root      28 Jan  8  2019 fgrep
+  -rwxr-xr-x 1 root root   68880 Jan 10  2019 findmnt
+  -rwsr-xr-x 1 root root   34896 Apr 23  2020 fusermount
+  -rwxr-xr-x 1 root root  198976 Jan  8  2019 grep
+  -rwxr-xr-x 2 root root    2345 Jan  6  2019 gunzip
+  -rwxr-xr-x 1 root root    6375 Jan  6  2019 gzexe
+  -rwxr-xr-x 1 root root   98048 Jan  6  2019 gzip
+  -rwxr-xr-x 1 root root   26696 Sep 27  2018 hostname
+  -rwxr-xr-x 1 root root   68552 Mar  1  2019 ln
+  -rwxr-xr-x 1 root root   56760 Jul 27  2018 login
+  -rwxr-xr-x 1 root root  138856 Mar  1  2019 ls
+  -rwxr-xr-x 1 root root  108624 Jan 10  2019 lsblk
+  -rwxr-xr-x 1 root root   89088 Mar  1  2019 mkdir
+  -rwxr-xr-x 1 root root   68544 Mar  1  2019 mknod
+  -rwxr-xr-x 1 root root   43808 Mar  1  2019 mktemp
+  -rwxr-xr-x 1 root root   43008 Jan 10  2019 more
+  -rwsr-xr-x 1 root root   51280 Jan 10  2019 mount
+  -rwxr-xr-x 1 root root   14408 Jan 10  2019 mountpoint
+  -rwxr-xr-x 1 root root  138728 Mar  1  2019 mv
+  lrwxrwxrwx 1 root root       8 Sep 27  2018 nisdomainname -> hostname
+  lrwxrwxrwx 1 root root      14 Feb 15  2019 pidof -> /sbin/killall5
+  -rwxr-xr-x 1 root root   39616 Mar  1  2019 pwd
+  lrwxrwxrwx 1 root root       4 Apr 18  2019 rbash -> bash
+  -rwxr-xr-x 1 root root   47776 Mar  1  2019 readlink
+  -rwxr-xr-x 1 root root   68416 Mar  1  2019 rm
+  -rwxr-xr-x 1 root root   47776 Mar  1  2019 rmdir
+  -rwxr-xr-x 1 root root   23312 Jan 22  2019 run-parts
+  -rwxr-xr-x 1 root root  122224 Dec 23  2018 sed
+  lrwxrwxrwx 1 root root       4 Jan 13 09:04 sh -> bash
+  lrwxrwxrwx 1 root root       4 Dec 11 18:21 sh.distrib -> dash
+  -rwxr-xr-x 1 root root   39552 Mar  1  2019 sleep
+  -rwxr-xr-x 1 root root   80672 Mar  1  2019 stty
+  -rwsr-xr-x 1 root root   63568 Jan 10  2019 su
+  -rwxr-xr-x 1 root root   35488 Mar  1  2019 sync
+  -rwxr-xr-x 1 root root  445560 Apr 24  2019 tar
+  -rwxr-xr-x 1 root root   14440 Jan 22  2019 tempfile
+  -rwxr-xr-x 1 root root   97152 Mar  1  2019 touch
+  -rwxr-xr-x 1 root root   35424 Mar  1  2019 true
+  -rwxr-xr-x 1 root root   14328 Apr 23  2020 ulockmgr_server
+  -rwsr-xr-x 1 root root   34888 Jan 10  2019 umount
+  -rwxr-xr-x 1 root root   39584 Mar  1  2019 uname
+  -rwxr-xr-x 2 root root    2345 Jan  6  2019 uncompress
+  -rwxr-xr-x 1 root root  138856 Mar  1  2019 vdir
+  -rwxr-xr-x 1 root root   34896 Jan 10  2019 wdctl
+  -rwxr-xr-x 1 root root     946 Jan 22  2019 which
+  lrwxrwxrwx 1 root root       8 Sep 27  2018 ypdomainname -> hostname
+  -rwxr-xr-x 1 root root    1983 Jan  6  2019 zcat
+  -rwxr-xr-x 1 root root    1677 Jan  6  2019 zcmp
+  -rwxr-xr-x 1 root root    5879 Jan  6  2019 zdiff
+  -rwxr-xr-x 1 root root      29 Jan  6  2019 zegrep
+  -rwxr-xr-x 1 root root      29 Jan  6  2019 zfgrep
+  -rwxr-xr-x 1 root root    2080 Jan  6  2019 zforce
+  -rwxr-xr-x 1 root root    7584 Jan  6  2019 zgrep
+  -rwxr-xr-x 1 root root    2205 Jan  6  2019 zless
+  -rwxr-xr-x 1 root root    1841 Jan  6  2019 zmore
+  -rwxr-xr-x 1 root root    4552 Jan  6  2019 znew
+I: user script /srv/workspace/pbuilder/1325705/tmp/hooks/D02_print_environment finished
  -> Attempting to satisfy build-dependencies
  -> Creating pbuilder-satisfydepends-dummy package
 Package: pbuilder-satisfydepends-dummy
@@ -325,7 +359,7 @@
 Get: 111 http://deb.debian.org/debian buster/main amd64 python3-sphinx all 1.8.4-1 [481 kB]
 Get: 112 http://deb.debian.org/debian buster/main amd64 sphinx-rtd-theme-common all 0.4.3+dfsg-1 [1021 kB]
 Get: 113 http://deb.debian.org/debian buster/main amd64 python3-sphinx-rtd-theme all 0.4.3+dfsg-1 [9696 B]
-Fetched 114 MB in 2s (59.2 MB/s)
+Fetched 114 MB in 4s (29.5 MB/s)
 debconf: delaying package configuration, since apt-utils is not installed
 Selecting previously unselected package libbsd0:amd64.
 (Reading database ... 
(Reading database ... 5%
(Reading database ... 10%
(Reading database ... 15%
(Reading database ... 20%
(Reading database ... 25%
(Reading database ... 30%
(Reading database ... 35%
(Reading database ... 40%
(Reading database ... 45%
(Reading database ... 50%
(Reading database ... 55%
(Reading database ... 60%
(Reading database ... 65%
(Reading database ... 70%
(Reading database ... 75%
(Reading database ... 80%
(Reading database ... 85%
(Reading database ... 90%
(Reading database ... 95%
(Reading database ... 100%
(Reading database ... 19195 files and directories currently installed.)
@@ -833,7 +867,8 @@
 fakeroot is already the newest version (1.23-1).
 0 upgraded, 0 newly installed, 0 to remove and 0 not upgraded.
 I: Building the package
-I: Running cd /build/numba-0.42.0/ && env PATH="/usr/sbin:/usr/bin:/sbin:/bin:/usr/games" HOME="/nonexistent/first-build" dpkg-buildpackage -us -uc -b && env PATH="/usr/sbin:/usr/bin:/sbin:/bin:/usr/games" HOME="/nonexistent/first-build" dpkg-genchanges -S  > ../numba_0.42.0-1_source.changes
+hostname: Name or service not known
+I: Running cd /build/numba-0.42.0/ && env PATH="/usr/sbin:/usr/bin:/sbin:/bin:/usr/games:/i/capture/the/path" HOME="/nonexistent/second-build" dpkg-buildpackage -us -uc -b && env PATH="/usr/sbin:/usr/bin:/sbin:/bin:/usr/games:/i/capture/the/path" HOME="/nonexistent/second-build" dpkg-genchanges -S  > ../numba_0.42.0-1_source.changes
 dpkg-buildpackage: info: source package numba
 dpkg-buildpackage: info: source version 0.42.0-1
 dpkg-buildpackage: info: source distribution unstable
@@ -1599,8 +1634,8 @@
 
 creating build/temp.linux-amd64-3.7/numba/runtime
 compile options: '-I/usr/lib/python3/dist-packages/numpy/core/include -I/usr/include/python3.7m -c'
-x86_64-linux-gnu-gcc: numba/runtime/nrt.c
 x86_64-linux-gnu-gcc: numba/runtime/_nrt_pythonmod.c
+x86_64-linux-gnu-gcc: numba/runtime/nrt.c
 x86_64-linux-gnu-gcc -pthread -shared -Wl,-O1 -Wl,-Bsymbolic-functions -Wl,-z,relro -Wl,-z,relro -Wl,-z,now -g -O2 -ffile-prefix-map=/build/numba-0.42.0=. -fstack-protector-strong -Wformat -Werror=format-security -Wdate-time -D_FORTIFY_SOURCE=2 build/temp.linux-amd64-3.7/numba/runtime/_nrt_pythonmod.o build/temp.linux-amd64-3.7/numba/runtime/nrt.o -L/usr/lib/python3/dist-packages/numpy/core/lib -lnpymath -lm -o /build/numba-0.42.0/.pybuild/cpython3_3.7_numba/build/numba/runtime/_nrt_python.cpython-37m-x86_64-linux-gnu.so
 building 'numba.jitclass._box' extension
 C compiler: x86_64-linux-gnu-gcc -pthread -DNDEBUG -g -fwrapv -O2 -Wall -g -O2 -ffile-prefix-map=/build/numba-0.42.0=. -fstack-protector-strong -Wformat -Werror=format-security -Wdate-time -D_FORTIFY_SOURCE=2 -fPIC
@@ -1644,8 +1679,8 @@
 creating build/scripts-3.7
 copying and adjusting numba/pycc/pycc -> build/scripts-3.7
 copying and adjusting bin/numba -> build/scripts-3.7
-changing mode of build/scripts-3.7/pycc from 644 to 755
-changing mode of build/scripts-3.7/numba from 644 to 755
+changing mode of build/scripts-3.7/pycc from 664 to 775
+changing mode of build/scripts-3.7/numba from 664 to 775
 UPDATING /build/numba-0.42.0/.pybuild/cpython3_3.7_numba/build/numba/_version.py
    debian/rules override_dh_auto_test
 make[1]: Entering directory '/build/numba-0.42.0'
@@ -9249,7 +9284,7 @@
     return self._consts.infer_constant(name)
 _ _ _ _ _ _ _ _ _ _ _ _ _ _ _ _ _ _ _ _ _ _ _ _ _ _ _ _ _ _ _ _ _ _ _ _ _ _ _ _ 
 
-self = <numba.consts.ConstantInference object at 0x7fb923cbb7f0>
+self = <numba.consts.ConstantInference object at 0x7fcc7460f710>
 name = '$100.19'
 
     def infer_constant(self, name):
@@ -9418,7 +9453,7 @@
     mod = import_dynamic(self.modname)
 numba/tests/support.py:563: in import_dynamic
     __import__(modname)
-/tmp/numba-tests.1111/test_cache-lf35ypjy/dispatcher_caching_test_fodder.py:19: in <module>
+/tmp/numba-tests.2222/test_cache-w4up5qxv/dispatcher_caching_test_fodder.py:19: in <module>
     @jit(cache=True, nopython=True)
 numba/decorators.py:176: in wrapper
     disp.enable_caching()
@@ -9428,8 +9463,8 @@
     self._impl = self._impl_class(py_func)
 _ _ _ _ _ _ _ _ _ _ _ _ _ _ _ _ _ _ _ _ _ _ _ _ _ _ _ _ _ _ _ _ _ _ _ _ _ _ _ _ 
 
-self = <numba.caching.CompileResultCacheImpl object at 0x7fb8db873a20>
-py_func = <function simple_usecase at 0x7fb9215a3d90>
+self = <numba.caching.CompileResultCacheImpl object at 0x7fcc3c52ea20>
+py_func = <function simple_usecase at 0x7fcc71d53bf8>
 
     def __init__(self, py_func):
         self._is_closure = bool(py_func.__closure__)
@@ -9448,7 +9483,7 @@
         else:
             raise RuntimeError("cannot cache function %r: no locator available "
 >                              "for file %r" % (qualname, source_path))
-E           RuntimeError: cannot cache function 'simple_usecase': no locator available for file '/tmp/numba-tests.1111/test_cache-lf35ypjy/dispatcher_caching_test_fodder.py'
+E           RuntimeError: cannot cache function 'simple_usecase': no locator available for file '/tmp/numba-tests.2222/test_cache-w4up5qxv/dispatcher_caching_test_fodder.py'
 
 numba/caching.py:349: RuntimeError
 _____________________ TestCache.test_non_writable_pycache ______________________
@@ -9476,7 +9511,7 @@
     mod = import_dynamic(self.modname)
 numba/tests/support.py:563: in import_dynamic
     __import__(modname)
-/tmp/numba-tests.1111/test_cache-i3xyis50/dispatcher_caching_test_fodder.py:19: in <module>
+/tmp/numba-tests.2222/test_cache-v3oh7wir/dispatcher_caching_test_fodder.py:19: in <module>
     @jit(cache=True, nopython=True)
 numba/decorators.py:176: in wrapper
     disp.enable_caching()
@@ -9486,8 +9521,8 @@
     self._impl = self._impl_class(py_func)
 _ _ _ _ _ _ _ _ _ _ _ _ _ _ _ _ _ _ _ _ _ _ _ _ _ _ _ _ _ _ _ _ _ _ _ _ _ _ _ _ 
 
-self = <numba.caching.CompileResultCacheImpl object at 0x7fb8d892f550>
-py_func = <function simple_usecase at 0x7fb8d7c939d8>
+self = <numba.caching.CompileResultCacheImpl object at 0x7fcc3da7d550>
+py_func = <function simple_usecase at 0x7fcc71d6e8c8>
 
     def __init__(self, py_func):
         self._is_closure = bool(py_func.__closure__)
@@ -9506,7 +9541,7 @@
         else:
             raise RuntimeError("cannot cache function %r: no locator available "
 >                              "for file %r" % (qualname, source_path))
-E           RuntimeError: cannot cache function 'simple_usecase': no locator available for file '/tmp/numba-tests.1111/test_cache-i3xyis50/dispatcher_caching_test_fodder.py'
+E           RuntimeError: cannot cache function 'simple_usecase': no locator available for file '/tmp/numba-tests.2222/test_cache-v3oh7wir/dispatcher_caching_test_fodder.py'
 
 numba/caching.py:349: RuntimeError
 __________________ TestRaising.test_assert_statement_nopython __________________
@@ -9546,7 +9581,7 @@
     return self._consts.infer_constant(name)
 _ _ _ _ _ _ _ _ _ _ _ _ _ _ _ _ _ _ _ _ _ _ _ _ _ _ _ _ _ _ _ _ _ _ _ _ _ _ _ _ 
 
-self = <numba.consts.ConstantInference object at 0x7fb8db9cdbe0>
+self = <numba.consts.ConstantInference object at 0x7fcc3b56def0>
 name = '$70.27'
 
     def infer_constant(self, name):
@@ -11002,7 +11037,7 @@
     return self._consts.infer_constant(name)
 _ _ _ _ _ _ _ _ _ _ _ _ _ _ _ _ _ _ _ _ _ _ _ _ _ _ _ _ _ _ _ _ _ _ _ _ _ _ _ _ 
 
-self = <numba.consts.ConstantInference object at 0x7fb829d02860>
+self = <numba.consts.ConstantInference object at 0x7fcb9cf20320>
 name = '$120.26'
 
     def infer_constant(self, name):
@@ -11171,7 +11206,7 @@
     restore_signals, start_new_session)
 _ _ _ _ _ _ _ _ _ _ _ _ _ _ _ _ _ _ _ _ _ _ _ _ _ _ _ _ _ _ _ _ _ _ _ _ _ _ _ _ 
 
-self = <subprocess.Popen object at 0x7fb922177be0>
+self = <subprocess.Popen object at 0x7fcc36f235f8>
 args = ['python', '-m', 'numba.runtests', '-l', 'numba.tests']
 executable = b'python', preexec_fn = None, close_fds = True, pass_fds = ()
 cwd = None, env = None, startupinfo = None, creationflags = 0, shell = False
@@ -11345,7 +11380,7 @@
     restore_signals, start_new_session)
 _ _ _ _ _ _ _ _ _ _ _ _ _ _ _ _ _ _ _ _ _ _ _ _ _ _ _ _ _ _ _ _ _ _ _ _ _ _ _ _ 
 
-self = <subprocess.Popen object at 0x7fb92217d5c0>
+self = <subprocess.Popen object at 0x7fcc349254a8>
 args = ['python', '-m', 'numba.runtests', '-l', 'numba.cuda.tests']
 executable = b'python', preexec_fn = None, close_fds = True, pass_fds = ()
 cwd = None, env = None, startupinfo = None, creationflags = 0, shell = False
@@ -11518,7 +11553,7 @@
     restore_signals, start_new_session)
 _ _ _ _ _ _ _ _ _ _ _ _ _ _ _ _ _ _ _ _ _ _ _ _ _ _ _ _ _ _ _ _ _ _ _ _ _ _ _ _ 
 
-self = <subprocess.Popen object at 0x7fb83fb6a208>
+self = <subprocess.Popen object at 0x7fcc3492c400>
 args = ['python', '-m', 'numba.runtests', '-l'], executable = b'python'
 preexec_fn = None, close_fds = True, pass_fds = (), cwd = None, env = None
 startupinfo = None, creationflags = 0, shell = False, p2cread = -1
@@ -11699,7 +11734,7 @@
     restore_signals, start_new_session)
 _ _ _ _ _ _ _ _ _ _ _ _ _ _ _ _ _ _ _ _ _ _ _ _ _ _ _ _ _ _ _ _ _ _ _ _ _ _ _ _ 
 
-self = <subprocess.Popen object at 0x7fb92215e470>
+self = <subprocess.Popen object at 0x7fcc34925908>
 args = ['python', '-m', 'numba.runtests', '-l', 'numba.tests']
 executable = b'python', preexec_fn = None, close_fds = True, pass_fds = ()
 cwd = None, env = None, startupinfo = None, creationflags = 0, shell = False
@@ -11870,7 +11905,7 @@
     restore_signals, start_new_session)
 _ _ _ _ _ _ _ _ _ _ _ _ _ _ _ _ _ _ _ _ _ _ _ _ _ _ _ _ _ _ _ _ _ _ _ _ _ _ _ _ 
 
-self = <subprocess.Popen object at 0x7fb92215b940>
+self = <subprocess.Popen object at 0x7fcb9e9423c8>
 args = ['python', '-m', 'numba.runtests', '-l', 'numba.tests.test_utils']
 executable = b'python', preexec_fn = None, close_fds = True, pass_fds = ()
 cwd = None, env = None, startupinfo = None, creationflags = 0, shell = False
@@ -12044,7 +12079,7 @@
     restore_signals, start_new_session)
 _ _ _ _ _ _ _ _ _ _ _ _ _ _ _ _ _ _ _ _ _ _ _ _ _ _ _ _ _ _ _ _ _ _ _ _ _ _ _ _ 
 
-self = <subprocess.Popen object at 0x7fb885fedc88>
+self = <subprocess.Popen object at 0x7fcc376384e0>
 args = ['python', '-m', 'numba.runtests', '-l', '--random', '0.1', ...]
 executable = b'python', preexec_fn = None, close_fds = True, pass_fds = ()
 cwd = None, env = None, startupinfo = None, creationflags = 0, shell = False
@@ -12215,7 +12250,7 @@
     restore_signals, start_new_session)
 _ _ _ _ _ _ _ _ _ _ _ _ _ _ _ _ _ _ _ _ _ _ _ _ _ _ _ _ _ _ _ _ _ _ _ _ _ _ _ _ 
 
-self = <subprocess.Popen object at 0x7fb8294ea160>
+self = <subprocess.Popen object at 0x7fcc34936588>
 args = ['python', '-m', 'numba.runtests', '-l', 'numba.tests.npyufunc']
 executable = b'python', preexec_fn = None, close_fds = True, pass_fds = ()
 cwd = None, env = None, startupinfo = None, creationflags = 0, shell = False
@@ -12664,7 +12699,7 @@
     infer.propagate()
 _ _ _ _ _ _ _ _ _ _ _ _ _ _ _ _ _ _ _ _ _ _ _ _ _ _ _ _ _ _ _ _ _ _ _ _ _ _ _ _ 
 
-self = <numba.typeinfer.TypeInferer object at 0x7fb81ae83358>
+self = <numba.typeinfer.TypeInferer object at 0x7fcc34f84cf8>
 raise_errors = True
 
     def propagate(self, raise_errors=True):
@@ -13350,7 +13385,7 @@
     infer.propagate()
 _ _ _ _ _ _ _ _ _ _ _ _ _ _ _ _ _ _ _ _ _ _ _ _ _ _ _ _ _ _ _ _ _ _ _ _ _ _ _ _ 
 
-self = <numba.typeinfer.TypeInferer object at 0x7fb88582feb8>
+self = <numba.typeinfer.TypeInferer object at 0x7fcb77517470>
 raise_errors = True
 
     def propagate(self, raise_errors=True):
@@ -14718,11 +14753,11 @@
     self.assertRegexpMatches(got, r'\[(\s*\d+)+\]')
 
 .pybuild/cpython3_3.7_numba/build/numba/tests/test_dispatcher.py::TestDispatcher::test_disabled_compilation_nested_call
-  /build/numba-0.42.0/.pybuild/cpython3_3.7_numba/build/numba/tests/test_dispatcher.py:323: NumbaWarning: Function "bar" failed type inference: Invalid use of type(CPUDispatcher(<function TestDispatcher.test_disabled_compilation_nested_call.<locals>.foo at 0x7fb8db7db048>)) with parameters (array(float64, 1d, C))
+  /build/numba-0.42.0/.pybuild/cpython3_3.7_numba/build/numba/tests/test_dispatcher.py:323: NumbaWarning: Function "bar" failed type inference: Invalid use of type(CPUDispatcher(<function TestDispatcher.test_disabled_compilation_nested_call.<locals>.foo at 0x7fcc3c6bdc80>)) with parameters (array(float64, 1d, C))
   Known signatures:
    * (int64,) -> int64
    * parameterized
-  [1] During: resolving callee type: type(CPUDispatcher(<function TestDispatcher.test_disabled_compilation_nested_call.<locals>.foo at 0x7fb8db7db048>))
+  [1] During: resolving callee type: type(CPUDispatcher(<function TestDispatcher.test_disabled_compilation_nested_call.<locals>.foo at 0x7fcc3c6bdc80>))
   [2] During: typing of call at /build/numba-0.42.0/.pybuild/cpython3_3.7_numba/build/numba/tests/test_dispatcher.py (326)
   
   
@@ -14742,7 +14777,7 @@
     r"Ambiguous overloading for <function add [^>]*> \(float64, float64\):\n"
 
 .pybuild/cpython3_3.7_numba/build/numba/tests/test_dispatcher.py::TestDispatcher::test_fingerprint_failure
-  /build/numba-0.42.0/.pybuild/cpython3_3.7_numba/build/numba/tests/test_dispatcher.py:339: NumbaWarning: Function "foo" failed type inference: Internal error at <numba.typeinfer.ArgConstraint object at 0x7fb8db7de438>:
+  /build/numba-0.42.0/.pybuild/cpython3_3.7_numba/build/numba/tests/test_dispatcher.py:339: NumbaWarning: Function "foo" failed type inference: Internal error at <numba.typeinfer.ArgConstraint object at 0x7fcc38a920f0>:
   --%<----------------------------------------------------------------------------
   Traceback (most recent call last):
     File "/build/numba-0.42.0/.pybuild/cpython3_3.7_numba/build/numba/errors.py", line 617, in new_error_context
@@ -14795,7 +14830,7 @@
     @jit
   /build/numba-0.42.0/.pybuild/cpython3_3.7_numba/build/numba/tests/test_dispatcher.py:357: NumbaWarning: Function "bar" was compiled in object mode without forceobj=True, but has lifted loops.
     @jit
-  /build/numba-0.42.0/.pybuild/cpython3_3.7_numba/build/numba/tests/test_dispatcher.py:357: NumbaWarning: Function "bar" failed type inference: Internal error at <numba.typeinfer.ArgConstraint object at 0x7fb8d8885ef0>:
+  /build/numba-0.42.0/.pybuild/cpython3_3.7_numba/build/numba/tests/test_dispatcher.py:357: NumbaWarning: Function "bar" failed type inference: Internal error at <numba.typeinfer.ArgConstraint object at 0x7fcc3d0c0c50>:
   --%<----------------------------------------------------------------------------
   Traceback (most recent call last):
     File "/build/numba-0.42.0/.pybuild/cpython3_3.7_numba/build/numba/errors.py", line 617, in new_error_context
@@ -15186,7 +15221,7 @@
     self.assertRegexpMatches(got, r'^\d+f(\$[a-z0-9][a-z0-9])+z$')
 
 .pybuild/cpython3_3.7_numba/build/numba/tests/test_jitmethod.py::TestJITMethod::test_bound_jit_method_with_loop_lift
-  /build/numba-0.42.0/.pybuild/cpython3_3.7_numba/build/numba/tests/test_jitmethod.py:16: NumbaWarning: Function "method" failed type inference: Internal error at <numba.typeinfer.ArgConstraint object at 0x7fb9210fb160>:
+  /build/numba-0.42.0/.pybuild/cpython3_3.7_numba/build/numba/tests/test_jitmethod.py:16: NumbaWarning: Function "method" failed type inference: Internal error at <numba.typeinfer.ArgConstraint object at 0x7fcc71f3c400>:
   --%<----------------------------------------------------------------------------
   Traceback (most recent call last):
     File "/build/numba-0.42.0/.pybuild/cpython3_3.7_numba/build/numba/errors.py", line 617, in new_error_context
@@ -15233,7 +15268,7 @@
     @jit
 
 .pybuild/cpython3_3.7_numba/build/numba/tests/test_jitmethod.py::TestJITMethod::test_unbound_jit_method
-  /build/numba-0.42.0/.pybuild/cpython3_3.7_numba/build/numba/tests/test_jitmethod.py:41: NumbaWarning: Function "method" failed type inference: Internal error at <numba.typeinfer.ArgConstraint object at 0x7fb8d5718f60>:
+  /build/numba-0.42.0/.pybuild/cpython3_3.7_numba/build/numba/tests/test_jitmethod.py:41: NumbaWarning: Function "method" failed type inference: Internal error at <numba.typeinfer.ArgConstraint object at 0x7fcc338e30b8>:
   --%<----------------------------------------------------------------------------
   Traceback (most recent call last):
     File "/build/numba-0.42.0/.pybuild/cpython3_3.7_numba/build/numba/errors.py", line 617, in new_error_context
@@ -15554,7 +15589,7 @@
     def foo(x):
 
 .pybuild/cpython3_3.7_numba/build/numba/tests/test_looplifting.py::TestLoopLiftingInAction::test_issue_2368
-  /build/numba-0.42.0/.pybuild/cpython3_3.7_numba/build/numba/tests/test_looplifting.py:353: NumbaWarning: Function "lift_issue2368" failed type inference: Internal error at <numba.typeinfer.ArgConstraint object at 0x7fb8d0443860>:
+  /build/numba-0.42.0/.pybuild/cpython3_3.7_numba/build/numba/tests/test_looplifting.py:353: NumbaWarning: Function "lift_issue2368" failed type inference: Internal error at <numba.typeinfer.ArgConstraint object at 0x7fcbfd96bb38>:
   --%<----------------------------------------------------------------------------
   Traceback (most recent call last):
     File "/build/numba-0.42.0/.pybuild/cpython3_3.7_numba/build/numba/errors.py", line 617, in new_error_context
@@ -15733,7 +15768,7 @@
     DT('2014-01-01T00:01Z', 'm'), False)
 
 .pybuild/cpython3_3.7_numba/build/numba/tests/test_npdatetime.py::TestMetadataScalingFactor::test_datetime
-  /build/numba-0.42.0/.pybuild/cpython3_3.7_numba/build/numba/tests/test_npdatetime.py:47: NumbaWarning: Function "eq_usecase" failed type inference: Internal error at <numba.typeinfer.ArgConstraint object at 0x7fb8c3976710>:
+  /build/numba-0.42.0/.pybuild/cpython3_3.7_numba/build/numba/tests/test_npdatetime.py:47: NumbaWarning: Function "eq_usecase" failed type inference: Internal error at <numba.typeinfer.ArgConstraint object at 0x7fcc310fc2b0>:
   --%<----------------------------------------------------------------------------
   Traceback (most recent call last):
     File "/build/numba-0.42.0/.pybuild/cpython3_3.7_numba/build/numba/errors.py", line 617, in new_error_context
@@ -15770,7 +15805,7 @@
     def eq_usecase(x, y):
 
 .pybuild/cpython3_3.7_numba/build/numba/tests/test_npdatetime.py::TestMetadataScalingFactor::test_timedelta
-  /build/numba-0.42.0/.pybuild/cpython3_3.7_numba/build/numba/tests/test_npdatetime.py:47: NumbaWarning: Function "eq_usecase" failed type inference: Internal error at <numba.typeinfer.ArgConstraint object at 0x7fb8c211fdd8>:
+  /build/numba-0.42.0/.pybuild/cpython3_3.7_numba/build/numba/tests/test_npdatetime.py:47: NumbaWarning: Function "eq_usecase" failed type inference: Internal error at <numba.typeinfer.ArgConstraint object at 0x7fcc319d5358>:
   --%<----------------------------------------------------------------------------
   Traceback (most recent call last):
     File "/build/numba-0.42.0/.pybuild/cpython3_3.7_numba/build/numba/errors.py", line 617, in new_error_context
@@ -15807,7 +15842,7 @@
     def eq_usecase(x, y):
 
 .pybuild/cpython3_3.7_numba/build/numba/tests/test_object_mode.py::TestObjectMode::test_array_of_object
-  /build/numba-0.42.0/.pybuild/cpython3_3.7_numba/build/numba/tests/test_object_mode.py:40: NumbaWarning: Function "array_of_object" failed type inference: Internal error at <numba.typeinfer.ArgConstraint object at 0x7fb8d5395f28>:
+  /build/numba-0.42.0/.pybuild/cpython3_3.7_numba/build/numba/tests/test_object_mode.py:40: NumbaWarning: Function "array_of_object" failed type inference: Internal error at <numba.typeinfer.ArgConstraint object at 0x7fcbfc4bb5c0>:
   --%<----------------------------------------------------------------------------
   Traceback (most recent call last):
     File "/build/numba-0.42.0/.pybuild/cpython3_3.7_numba/build/numba/errors.py", line 617, in new_error_context
@@ -15896,7 +15931,7 @@
     def delattr_usecase(o):
 
 .pybuild/cpython3_3.7_numba/build/numba/tests/test_objects.py::TestAttributes::test_setattr
-  /build/numba-0.42.0/.pybuild/cpython3_3.7_numba/build/numba/tests/test_objects.py:27: NumbaWarning: Function "setattr_usecase" failed type inference: Internal error at <numba.typeinfer.ArgConstraint object at 0x7fb8d23b20f0>:
+  /build/numba-0.42.0/.pybuild/cpython3_3.7_numba/build/numba/tests/test_objects.py:27: NumbaWarning: Function "setattr_usecase" failed type inference: Internal error at <numba.typeinfer.ArgConstraint object at 0x7fcc378a3128>:
   --%<----------------------------------------------------------------------------
   Traceback (most recent call last):
     File "/build/numba-0.42.0/.pybuild/cpython3_3.7_numba/build/numba/errors.py", line 617, in new_error_context
@@ -15933,7 +15968,7 @@
     def setattr_usecase(o, v):
 
 .pybuild/cpython3_3.7_numba/build/numba/tests/test_objects.py::TestAttributes::test_setattr_attribute_error
-  /build/numba-0.42.0/.pybuild/cpython3_3.7_numba/build/numba/tests/test_objects.py:27: NumbaWarning: Function "setattr_usecase" failed type inference: Internal error at <numba.typeinfer.ArgConstraint object at 0x7fb89faa5080>:
+  /build/numba-0.42.0/.pybuild/cpython3_3.7_numba/build/numba/tests/test_objects.py:27: NumbaWarning: Function "setattr_usecase" failed type inference: Internal error at <numba.typeinfer.ArgConstraint object at 0x7fcc739353c8>:
   --%<----------------------------------------------------------------------------
   Traceback (most recent call last):
     File "/build/numba-0.42.0/.pybuild/cpython3_3.7_numba/build/numba/errors.py", line 617, in new_error_context
@@ -16167,8 +16202,6 @@
     super(DUFunc, self).__init__(dispatcher, **kws)
   /build/numba-0.42.0/.pybuild/cpython3_3.7_numba/build/numba/npyufunc/dufunc.py:86: DeprecationWarning: inspect.getargspec() is deprecated since Python 3.0, use inspect.signature() or inspect.getfullargspec()
     super(DUFunc, self).__init__(dispatcher, **kws)
-  /build/numba-0.42.0/.pybuild/cpython3_3.7_numba/build/numba/npyufunc/dufunc.py:86: DeprecationWarning: inspect.getargspec() is deprecated since Python 3.0, use inspect.signature() or inspect.getfullargspec()
-    super(DUFunc, self).__init__(dispatcher, **kws)
 
 .pybuild/cpython3_3.7_numba/build/numba/tests/test_threadsafety.py::TestThreadSafety::test_concurrent_vectorize
   /build/numba-0.42.0/.pybuild/cpython3_3.7_numba/build/numba/npyufunc/dufunc.py:86: DeprecationWarning: inspect.getargspec() is deprecated since Python 3.0, use inspect.signature() or inspect.getfullargspec()
@@ -16241,6 +16274,8 @@
     super(DUFunc, self).__init__(dispatcher, **kws)
   /build/numba-0.42.0/.pybuild/cpython3_3.7_numba/build/numba/npyufunc/dufunc.py:86: DeprecationWarning: inspect.getargspec() is deprecated since Python 3.0, use inspect.signature() or inspect.getfullargspec()
     super(DUFunc, self).__init__(dispatcher, **kws)
+  /build/numba-0.42.0/.pybuild/cpython3_3.7_numba/build/numba/npyufunc/dufunc.py:86: DeprecationWarning: inspect.getargspec() is deprecated since Python 3.0, use inspect.signature() or inspect.getfullargspec()
+    super(DUFunc, self).__init__(dispatcher, **kws)
 
 .pybuild/cpython3_3.7_numba/build/numba/tests/test_threadsafety.py::TestThreadSafety::test_concurrent_vectorize_cache
   /build/numba-0.42.0/.pybuild/cpython3_3.7_numba/build/numba/npyufunc/dufunc.py:86: DeprecationWarning: inspect.getargspec() is deprecated since Python 3.0, use inspect.signature() or inspect.getfullargspec()
@@ -16778,7 +16813,7 @@
     super(DUFunc, self).__init__(dispatcher, **kws)
 
 .pybuild/cpython3_3.7_numba/build/numba/tests/test_usecases.py::TestUsecases::test_string_comparisons
-  /build/numba-0.42.0/.pybuild/cpython3_3.7_numba/build/numba/tests/usecases.py:73: NumbaWarning: Function "string_comparison" failed type inference: Internal error at <numba.typeinfer.ArgConstraint object at 0x7fb7e0e61710>:
+  /build/numba-0.42.0/.pybuild/cpython3_3.7_numba/build/numba/tests/usecases.py:73: NumbaWarning: Function "string_comparison" failed type inference: Internal error at <numba.typeinfer.ArgConstraint object at 0x7fcb6f2e7d68>:
   --%<----------------------------------------------------------------------------
   Traceback (most recent call last):
     File "/build/numba-0.42.0/.pybuild/cpython3_3.7_numba/build/numba/errors.py", line 617, in new_error_context
@@ -16851,7 +16886,7 @@
     def string_conversion(x):
 
 .pybuild/cpython3_3.7_numba/build/numba/tests/test_usecases.py::TestUsecases::test_string_len
-  /build/numba-0.42.0/.pybuild/cpython3_3.7_numba/build/numba/tests/usecases.py:61: NumbaWarning: Function "string_len" failed type inference: Internal error at <numba.typeinfer.ArgConstraint object at 0x7fb7fb185a90>:
+  /build/numba-0.42.0/.pybuild/cpython3_3.7_numba/build/numba/tests/usecases.py:61: NumbaWarning: Function "string_len" failed type inference: Internal error at <numba.typeinfer.ArgConstraint object at 0x7fcb75615c88>:
   --%<----------------------------------------------------------------------------
   Traceback (most recent call last):
     File "/build/numba-0.42.0/.pybuild/cpython3_3.7_numba/build/numba/errors.py", line 617, in new_error_context
@@ -16888,7 +16923,7 @@
     def string_len(s):
 
 .pybuild/cpython3_3.7_numba/build/numba/tests/test_usecases.py::TestUsecases::test_string_slicing
-  /build/numba-0.42.0/.pybuild/cpython3_3.7_numba/build/numba/tests/usecases.py:65: NumbaWarning: Function "string_slicing" failed type inference: Internal error at <numba.typeinfer.ArgConstraint object at 0x7fb819c4dbe0>:
+  /build/numba-0.42.0/.pybuild/cpython3_3.7_numba/build/numba/tests/usecases.py:65: NumbaWarning: Function "string_slicing" failed type inference: Internal error at <numba.typeinfer.ArgConstraint object at 0x7fcc358aa7b8>:
   --%<----------------------------------------------------------------------------
   Traceback (most recent call last):
     File "/build/numba-0.42.0/.pybuild/cpython3_3.7_numba/build/numba/errors.py", line 617, in new_error_context
@@ -17314,7 +17349,7 @@
     super(DUFunc, self).__init__(dispatcher, **kws)
 
 -- Docs: https://docs.pytest.org/en/latest/warnings.html
- 108 failed, 6981 passed, 238 skipped, 8 xfailed, 786 warnings, 7 error in 15554.21 seconds 
+ 108 failed, 6981 passed, 238 skipped, 8 xfailed, 786 warnings, 7 error in 16480.53 seconds 
 /usr/lib/python3/dist-packages/_pytest/assertion/rewrite.py:8: DeprecationWarning: the imp module is deprecated in favour of importlib; see the module's documentation for alternative uses
   import imp
 E: pybuild pybuild:341: test: plugin custom failed with: exit code=1: cd /build/numba-0.42.0/.pybuild/cpython3_3.7_numba/build && python3.7 -Wd -m pytest numba/tests -v -rs
@@ -18999,8 +19034,8 @@
 creating /build/numba-0.42.0/debian/python3-numba/usr/share/python3-numba
 copying build/scripts-3.7/numba -> /build/numba-0.42.0/debian/python3-numba/usr/share/python3-numba
 copying build/scripts-3.7/pycc -> /build/numba-0.42.0/debian/python3-numba/usr/share/python3-numba
-changing mode of /build/numba-0.42.0/debian/python3-numba/usr/share/python3-numba/numba to 755
-changing mode of /build/numba-0.42.0/debian/python3-numba/usr/share/python3-numba/pycc to 755
+changing mode of /build/numba-0.42.0/debian/python3-numba/usr/share/python3-numba/numba to 775
+changing mode of /build/numba-0.42.0/debian/python3-numba/usr/share/python3-numba/pycc to 775
    dh_install -O--buildsystem=pybuild
    debian/rules override_dh_installdocs
 make[1]: Entering directory '/build/numba-0.42.0'
@@ -19247,17 +19282,17 @@
    dh_shlibdeps -O--buildsystem=pybuild
    dh_installdeb -O--buildsystem=pybuild
    dh_gencontrol -O--buildsystem=pybuild
-dpkg-gencontrol: warning: package python3-numba: substitution variable ${python3:Provides} unused, but is defined
-dpkg-gencontrol: warning: package python3-numba: substitution variable ${python3:Versions} unused, but is defined
 dpkg-gencontrol: warning: package numba-doc: substitution variable ${python3:Depends} unused, but is defined
 dpkg-gencontrol: warning: package numba-doc: substitution variable ${sphinxdoc:Built-Using} unused, but is defined
 dpkg-gencontrol: warning: package python3-numba: substitution variable ${python3:Provides} unused, but is defined
 dpkg-gencontrol: warning: package python3-numba: substitution variable ${python3:Versions} unused, but is defined
+dpkg-gencontrol: warning: package python3-numba: substitution variable ${python3:Provides} unused, but is defined
+dpkg-gencontrol: warning: package python3-numba: substitution variable ${python3:Versions} unused, but is defined
    dh_md5sums -O--buildsystem=pybuild
    dh_builddeb -O--buildsystem=pybuild
-dpkg-deb: building package 'python3-numba' in '../python3-numba_0.42.0-1_amd64.deb'.
 dpkg-deb: building package 'numba-doc' in '../numba-doc_0.42.0-1_all.deb'.
 dpkg-deb: building package 'python3-numba-dbgsym' in '../python3-numba-dbgsym_0.42.0-1_amd64.deb'.
+dpkg-deb: building package 'python3-numba' in '../python3-numba_0.42.0-1_amd64.deb'.
  dpkg-genbuildinfo --build=binary
  dpkg-genchanges --build=binary >../numba_0.42.0-1_amd64.changes
 dpkg-genchanges: info: binary-only upload (no source code included)
@@ -19265,12 +19300,14 @@
 dpkg-buildpackage: info: binary-only upload (no source included)
 dpkg-genchanges: info: including full source code in upload
 I: copying local configuration
+I: user script /srv/workspace/pbuilder/1325705/tmp/hooks/B01_cleanup starting
+I: user script /srv/workspace/pbuilder/1325705/tmp/hooks/B01_cleanup finished
 I: unmounting dev/ptmx filesystem
 I: unmounting dev/pts filesystem
 I: unmounting dev/shm filesystem
 I: unmounting proc filesystem
 I: unmounting sys filesystem
 I: cleaning the build env 
-I: removing directory /srv/workspace/pbuilder/319807 and its subdirectories
-I: Current time: Fri Dec 10 00:41:10 -12 2021
-I: pbuilder-time-stamp: 1639140070
+I: removing directory /srv/workspace/pbuilder/1325705 and its subdirectories
+I: Current time: Fri Jan 13 13:43:48 +14 2023
+I: pbuilder-time-stamp: 1673567028