Sun Jan  7 18:10:36 UTC 2024  I: starting to build traildb/bookworm/arm64 on jenkins on '2024-01-07 18:10'
Sun Jan  7 18:10:36 UTC 2024  I: The jenkins build log is/was available at https://jenkins.debian.net/userContent/reproducible/debian/build_service/arm64_15/22882/console.log
Sun Jan  7 18:10:36 UTC 2024  I: Downloading source for bookworm/traildb=0.6+dfsg1-1
--2024-01-07 18:10:36--  http://cdn-fastly.deb.debian.org/debian/pool/main/t/traildb/traildb_0.6%2bdfsg1-1.dsc
Connecting to 78.137.99.97:3128... connected.
Proxy request sent, awaiting response... 200 OK
Length: 2042 (2.0K) [text/prs.lines.tag]
Saving to: ‘traildb_0.6+dfsg1-1.dsc’

     0K .                                                     100%  146M=0s

2024-01-07 18:10:36 (146 MB/s) - ‘traildb_0.6+dfsg1-1.dsc’ saved [2042/2042]

Sun Jan  7 18:10:36 UTC 2024  I: traildb_0.6+dfsg1-1.dsc
-----BEGIN PGP SIGNED MESSAGE-----
Hash: SHA512

Format: 3.0 (quilt)
Source: traildb
Binary: traildb-cli, libtraildb-dev, libtraildb0
Architecture: any
Version: 0.6+dfsg1-1
Maintainer: ChangZhuo Chen (陳昌倬) <czchen@debian.org>
Homepage: https://github.com/traildb/traildb
Standards-Version: 3.9.8
Vcs-Browser: https://anonscm.debian.org/git/collab-maint/traildb.git
Vcs-Git: https://anonscm.debian.org/git/collab-maint/traildb.git
Build-Depends: debhelper (>= 10), libarchive-dev, libjudy-dev, pkg-config
Package-List:
 libtraildb-dev deb libdevel optional arch=any
 libtraildb0 deb libs optional arch=any
 traildb-cli deb database optional arch=any
Checksums-Sha1:
 00973a796ebecc7bb451b370bbf9f3c511b9ffa3 341204 traildb_0.6+dfsg1.orig.tar.gz
 bafc0c605a491cee3b4348f63c0559c6397d669d 4256 traildb_0.6+dfsg1-1.debian.tar.xz
Checksums-Sha256:
 ad3c727ff607de92c3d0f57a1450a44acf64b3f27fcb96b72b71d7216e295201 341204 traildb_0.6+dfsg1.orig.tar.gz
 796026d05178b96a938fde9046b3a8b7925968ed1622b47e125be98e3a7cfbbd 4256 traildb_0.6+dfsg1-1.debian.tar.xz
Files:
 ec0106490f584b3678f3a86304c4ea6b 341204 traildb_0.6+dfsg1.orig.tar.gz
 f916d56200e7bf8b31a08d616ce3a1bf 4256 traildb_0.6+dfsg1-1.debian.tar.xz

-----BEGIN PGP SIGNATURE-----

iQIzBAEBCgAdFiEEE5H9tOJ8ReWWaF1PGrc2MXdaTaQFAlkdGoYACgkQGrc2MXda
TaSXTBAA0Nod1+d1KqN4MGhp0A6YDcon2SiOvaXORluoTem2o6kAdajsyCzETxPf
w2ApqXW6ah7oSRVnahtNngJiMc9KL4OLKJk9ZNijpL3OQZ+Vv4XmrWujNlcaZjES
e3Hr10Kwqimz2G+fll/dzdPZeFGQzK2jBUYYye9WBMgdomuF6HDMA9aSjfFLYjZq
brrITEE8pY8EUnake2D7eFpU2wyQnuaiTvT61rdCoRqcfWlXuUyh2l8veo5dmqXa
tNX0/6gvdA531G5KjMPTsIkVHiFjWSXCHk+yE9GxoiqAJJyUWqk4F5Bm2LcHvhaq
JugdQtcNilgz/JkIJeuptmhBoCJf9uFwZR2hOdfyEsj8NWhX24KZN+oJKcAgkCP2
Vj5Mhh9oUzVdUDNjkqqI/hLbDKnuIlZkIrEA9drRVrYeBYIEF2WdVz1aUFEQNWa6
RoPNVQIGwQRifP5PnqIxmTC85cQ+O+BkOpTgNYp5Um53SLvGUVK1xEpt/DRZ4cDU
K1gvfUaAqt/BCvGwllvjKZvoljBu/wSy5A2MhuyIoZkeyYaGFl2vRi5R/SvyZZEw
mgSvbvNVK3lydr0hQoqtNPmvjIjDKPlSRcuM3Fs9LcZETyabgulthFhmZWW19xmV
fNgqBhWUhTNi5T9oPzlSZExsykM5upKmt8C8LLyItpLEKLZ9k8Y=
=62j4
-----END PGP SIGNATURE-----
Sun Jan  7 18:10:36 UTC 2024  I: Checking whether the package is not for us
Sun Jan  7 18:10:36 UTC 2024  I: Starting 1st build on remote node codethink01-arm64.debian.net.
Sun Jan  7 18:10:36 UTC 2024  I: Preparing to do remote build '1' on codethink01-arm64.debian.net.
Sun Jan  7 18:11:29 UTC 2024  I: Deleting $TMPDIR on codethink01-arm64.debian.net.
I: pbuilder: network access will be disabled during build
I: Current time: Sat Feb  8 12:33:38 -12 2025
I: pbuilder-time-stamp: 1739061218
I: Building the build Environment
I: extracting base tarball [/var/cache/pbuilder/bookworm-reproducible-base.tgz]
I: copying local configuration
W: --override-config is not set; not updating apt.conf Read the manpage for details.
I: mounting /proc filesystem
I: mounting /sys filesystem
I: creating /{dev,run}/shm
I: mounting /dev/pts filesystem
I: redirecting /dev/ptmx to /dev/pts/ptmx
I: policy-rc.d already exists
I: Copying source file
I: copying [traildb_0.6+dfsg1-1.dsc]
I: copying [./traildb_0.6+dfsg1.orig.tar.gz]
I: copying [./traildb_0.6+dfsg1-1.debian.tar.xz]
I: Extracting source
gpgv: Signature made Thu May 18 03:52:38 2017 
gpgv:                using RSA key 1391FDB4E27C45E596685D4F1AB73631775A4DA4
gpgv: Can't check signature: No public key
dpkg-source: warning: cannot verify inline signature for ./traildb_0.6+dfsg1-1.dsc: no acceptable signature found
dpkg-source: info: extracting traildb in traildb-0.6+dfsg1
dpkg-source: info: unpacking traildb_0.6+dfsg1.orig.tar.gz
dpkg-source: info: unpacking traildb_0.6+dfsg1-1.debian.tar.xz
dpkg-source: info: using patch list from debian/patches/series
dpkg-source: info: applying fix-autotools.patch
I: using fakeroot in build.
I: Installing the build-deps
I: user script /srv/workspace/pbuilder/2006718/tmp/hooks/D02_print_environment starting
I: set
  BUILDDIR='/build/reproducible-path'
  BUILDUSERGECOS='first user,first room,first work-phone,first home-phone,first other'
  BUILDUSERNAME='pbuilder1'
  BUILD_ARCH='arm64'
  DEBIAN_FRONTEND='noninteractive'
  DEB_BUILD_OPTIONS='buildinfo=+all reproducible=+all parallel=12 '
  DISTRIBUTION='bookworm'
  HOME='/root'
  HOST_ARCH='arm64'
  IFS=' 	
  '
  INVOCATION_ID='10761ad487b64ccfa1fd41074b8ca544'
  LANG='C'
  LANGUAGE='en_US:en'
  LC_ALL='C'
  MAIL='/var/mail/root'
  OPTIND='1'
  PATH='/usr/sbin:/usr/bin:/sbin:/bin:/usr/games'
  PBCURRENTCOMMANDLINEOPERATION='build'
  PBUILDER_OPERATION='build'
  PBUILDER_PKGDATADIR='/usr/share/pbuilder'
  PBUILDER_PKGLIBDIR='/usr/lib/pbuilder'
  PBUILDER_SYSCONFDIR='/etc'
  PPID='2006718'
  PS1='# '
  PS2='> '
  PS4='+ '
  PWD='/'
  SHELL='/bin/bash'
  SHLVL='2'
  SUDO_COMMAND='/usr/bin/timeout -k 18.1h 18h /usr/bin/ionice -c 3 /usr/bin/nice /usr/sbin/pbuilder --build --configfile /srv/reproducible-results/rbuild-debian/r-b-build.mEdG5Bhx/pbuilderrc_XaVG --distribution bookworm --hookdir /etc/pbuilder/first-build-hooks --debbuildopts -b --basetgz /var/cache/pbuilder/bookworm-reproducible-base.tgz --buildresult /srv/reproducible-results/rbuild-debian/r-b-build.mEdG5Bhx/b1 --logfile b1/build.log traildb_0.6+dfsg1-1.dsc'
  SUDO_GID='109'
  SUDO_UID='104'
  SUDO_USER='jenkins'
  TERM='unknown'
  TZ='/usr/share/zoneinfo/Etc/GMT+12'
  USER='root'
  _='/usr/bin/systemd-run'
  http_proxy='http://192.168.101.104:3128'
I: uname -a
  Linux codethink01-arm64 6.1.0-17-cloud-arm64 #1 SMP Debian 6.1.69-1 (2023-12-30) aarch64 GNU/Linux
I: ls -l /bin
  total 7104
  -rwxr-xr-x 1 root root 1346480 Apr 23  2023 bash
  -rwxr-xr-x 3 root root   67728 Sep 19  2022 bunzip2
  -rwxr-xr-x 3 root root   67728 Sep 19  2022 bzcat
  lrwxrwxrwx 1 root root       6 Sep 19  2022 bzcmp -> bzdiff
  -rwxr-xr-x 1 root root    2225 Sep 19  2022 bzdiff
  lrwxrwxrwx 1 root root       6 Sep 19  2022 bzegrep -> bzgrep
  -rwxr-xr-x 1 root root    4893 Nov 27  2021 bzexe
  lrwxrwxrwx 1 root root       6 Sep 19  2022 bzfgrep -> bzgrep
  -rwxr-xr-x 1 root root    3775 Sep 19  2022 bzgrep
  -rwxr-xr-x 3 root root   67728 Sep 19  2022 bzip2
  -rwxr-xr-x 1 root root   67664 Sep 19  2022 bzip2recover
  lrwxrwxrwx 1 root root       6 Sep 19  2022 bzless -> bzmore
  -rwxr-xr-x 1 root root    1297 Sep 19  2022 bzmore
  -rwxr-xr-x 1 root root   68536 Sep 20  2022 cat
  -rwxr-xr-x 1 root root   68616 Sep 20  2022 chgrp
  -rwxr-xr-x 1 root root   68552 Sep 20  2022 chmod
  -rwxr-xr-x 1 root root   68632 Sep 20  2022 chown
  -rwxr-xr-x 1 root root  200264 Sep 20  2022 cp
  -rwxr-xr-x 1 root root  133640 Jan  5  2023 dash
  -rwxr-xr-x 1 root root  134144 Sep 20  2022 date
  -rwxr-xr-x 1 root root  134248 Sep 20  2022 dd
  -rwxr-xr-x 1 root root  134888 Sep 20  2022 df
  -rwxr-xr-x 1 root root  200440 Sep 20  2022 dir
  -rwxr-xr-x 1 root root  141720 Mar 23  2023 dmesg
  lrwxrwxrwx 1 root root       8 Dec 19  2022 dnsdomainname -> hostname
  lrwxrwxrwx 1 root root       8 Dec 19  2022 domainname -> hostname
  -rwxr-xr-x 1 root root   68408 Sep 20  2022 echo
  -rwxr-xr-x 1 root root      41 Jan 24  2023 egrep
  -rwxr-xr-x 1 root root   68384 Sep 20  2022 false
  -rwxr-xr-x 1 root root      41 Jan 24  2023 fgrep
  -rwxr-xr-x 1 root root  134584 Mar 23  2023 findmnt
  -rwsr-xr-x 1 root root   67744 Mar 23  2023 fusermount
  -rwxr-xr-x 1 root root  198880 Jan 24  2023 grep
  -rwxr-xr-x 2 root root    2346 Apr 10  2022 gunzip
  -rwxr-xr-x 1 root root    6447 Apr 10  2022 gzexe
  -rwxr-xr-x 1 root root   93752 Apr 10  2022 gzip
  -rwxr-xr-x 1 root root   67592 Dec 19  2022 hostname
  -rwxr-xr-x 1 root root   68664 Sep 20  2022 ln
  -rwxr-xr-x 1 root root   69208 Mar 23  2023 login
  -rwxr-xr-x 1 root root  200440 Sep 20  2022 ls
  -rwxr-xr-x 1 root root  264360 Mar 23  2023 lsblk
  -rwxr-xr-x 1 root root  134384 Sep 20  2022 mkdir
  -rwxr-xr-x 1 root root   68768 Sep 20  2022 mknod
  -rwxr-xr-x 1 root root   68472 Sep 20  2022 mktemp
  -rwxr-xr-x 1 root root   67752 Mar 23  2023 more
  -rwsr-xr-x 1 root root   67744 Mar 23  2023 mount
  -rwxr-xr-x 1 root root   67744 Mar 23  2023 mountpoint
  -rwxr-xr-x 1 root root  134728 Sep 20  2022 mv
  lrwxrwxrwx 1 root root       8 Dec 19  2022 nisdomainname -> hostname
  lrwxrwxrwx 1 root root      14 Apr  3  2023 pidof -> /sbin/killall5
  -rwxr-xr-x 1 root root   68496 Sep 20  2022 pwd
  lrwxrwxrwx 1 root root       4 Apr 23  2023 rbash -> bash
  -rwxr-xr-x 1 root root   68456 Sep 20  2022 readlink
  -rwxr-xr-x 1 root root   68592 Sep 20  2022 rm
  -rwxr-xr-x 1 root root   68480 Sep 20  2022 rmdir
  -rwxr-xr-x 1 root root   68392 Jul 28  2023 run-parts
  -rwxr-xr-x 1 root root  134536 Jan  5  2023 sed
  lrwxrwxrwx 1 root root       4 Jan  5  2023 sh -> dash
  -rwxr-xr-x 1 root root   68432 Sep 20  2022 sleep
  -rwxr-xr-x 1 root root  134088 Sep 20  2022 stty
  -rwsr-xr-x 1 root root  133312 Mar 23  2023 su
  -rwxr-xr-x 1 root root   68448 Sep 20  2022 sync
  -rwxr-xr-x 1 root root  539896 Apr  6  2023 tar
  -rwxr-xr-x 1 root root   67904 Jul 28  2023 tempfile
  -rwxr-xr-x 1 root root  134160 Sep 20  2022 touch
  -rwxr-xr-x 1 root root   68384 Sep 20  2022 true
  -rwxr-xr-x 1 root root   67664 Mar 23  2023 ulockmgr_server
  -rwsr-xr-x 1 root root   67744 Mar 23  2023 umount
  -rwxr-xr-x 1 root root   68416 Sep 20  2022 uname
  -rwxr-xr-x 2 root root    2346 Apr 10  2022 uncompress
  -rwxr-xr-x 1 root root  200440 Sep 20  2022 vdir
  -rwxr-xr-x 1 root root  133312 Mar 23  2023 wdctl
  lrwxrwxrwx 1 root root       8 Dec 19  2022 ypdomainname -> hostname
  -rwxr-xr-x 1 root root    1984 Apr 10  2022 zcat
  -rwxr-xr-x 1 root root    1678 Apr 10  2022 zcmp
  -rwxr-xr-x 1 root root    6460 Apr 10  2022 zdiff
  -rwxr-xr-x 1 root root      29 Apr 10  2022 zegrep
  -rwxr-xr-x 1 root root      29 Apr 10  2022 zfgrep
  -rwxr-xr-x 1 root root    2081 Apr 10  2022 zforce
  -rwxr-xr-x 1 root root    8103 Apr 10  2022 zgrep
  -rwxr-xr-x 1 root root    2206 Apr 10  2022 zless
  -rwxr-xr-x 1 root root    1842 Apr 10  2022 zmore
  -rwxr-xr-x 1 root root    4577 Apr 10  2022 znew
I: user script /srv/workspace/pbuilder/2006718/tmp/hooks/D02_print_environment finished
 -> Attempting to satisfy build-dependencies
 -> Creating pbuilder-satisfydepends-dummy package
Package: pbuilder-satisfydepends-dummy
Version: 0.invalid.0
Architecture: arm64
Maintainer: Debian Pbuilder Team <pbuilder-maint@lists.alioth.debian.org>
Description: Dummy package to satisfy dependencies with aptitude - created by pbuilder
 This package was created automatically by pbuilder to satisfy the
 build-dependencies of the package being currently built.
Depends: debhelper (>= 10), libarchive-dev, libjudy-dev, pkg-config
dpkg-deb: building package 'pbuilder-satisfydepends-dummy' in '/tmp/satisfydepends-aptitude/pbuilder-satisfydepends-dummy.deb'.
Selecting previously unselected package pbuilder-satisfydepends-dummy.
(Reading database ... 18171 files and directories currently installed.)
Preparing to unpack .../pbuilder-satisfydepends-dummy.deb ...
Unpacking pbuilder-satisfydepends-dummy (0.invalid.0) ...
dpkg: pbuilder-satisfydepends-dummy: dependency problems, but configuring anyway as you requested:
 pbuilder-satisfydepends-dummy depends on debhelper (>= 10); however:
  Package debhelper is not installed.
 pbuilder-satisfydepends-dummy depends on libarchive-dev; however:
  Package libarchive-dev is not installed.
 pbuilder-satisfydepends-dummy depends on libjudy-dev; however:
  Package libjudy-dev is not installed.
 pbuilder-satisfydepends-dummy depends on pkg-config; however:
  Package pkg-config is not installed.

Setting up pbuilder-satisfydepends-dummy (0.invalid.0) ...
Reading package lists...
Building dependency tree...
Reading state information...
Initializing package states...
Writing extended state information...
Building tag database...
pbuilder-satisfydepends-dummy is already installed at the requested version (0.invalid.0)
pbuilder-satisfydepends-dummy is already installed at the requested version (0.invalid.0)
The following NEW packages will be installed:
  autoconf{a} automake{a} autopoint{a} autotools-dev{a} bsdextrautils{a} debhelper{a} dh-autoreconf{a} dh-strip-nondeterminism{a} dwz{a} file{a} gettext{a} gettext-base{a} groff-base{a} intltool-debian{a} libarchive-dev{a} libarchive-zip-perl{a} libarchive13{a} libdebhelper-perl{a} libelf1{a} libfile-stripnondeterminism-perl{a} libicu72{a} libjudy-dev{a} libjudydebian1{a} libmagic-mgc{a} libmagic1{a} libpipeline1{a} libpkgconf3{a} libsub-override-perl{a} libtool{a} libuchardet0{a} libxml2{a} m4{a} man-db{a} pkg-config{a} pkgconf{a} pkgconf-bin{a} po-debconf{a} sensible-utils{a} 
The following packages are RECOMMENDED but will NOT be installed:
  curl libarchive-cpio-perl libltdl-dev libmail-sendmail-perl lynx wget 
0 packages upgraded, 38 newly installed, 0 to remove and 0 not upgraded.
Need to get 19.5 MB of archives. After unpacking 78.8 MB will be used.
Writing extended state information...
Get: 1 http://deb.debian.org/debian bookworm/main arm64 sensible-utils all 0.0.17+nmu1 [19.0 kB]
Get: 2 http://deb.debian.org/debian bookworm/main arm64 libmagic-mgc arm64 1:5.44-3 [305 kB]
Get: 3 http://deb.debian.org/debian bookworm/main arm64 libmagic1 arm64 1:5.44-3 [98.5 kB]
Get: 4 http://deb.debian.org/debian bookworm/main arm64 file arm64 1:5.44-3 [42.5 kB]
Get: 5 http://deb.debian.org/debian bookworm/main arm64 gettext-base arm64 0.21-12 [159 kB]
Get: 6 http://deb.debian.org/debian bookworm/main arm64 libuchardet0 arm64 0.0.7-1 [67.9 kB]
Get: 7 http://deb.debian.org/debian bookworm/main arm64 groff-base arm64 1.22.4-10 [861 kB]
Get: 8 http://deb.debian.org/debian bookworm/main arm64 bsdextrautils arm64 2.38.1-5+b1 [86.9 kB]
Get: 9 http://deb.debian.org/debian bookworm/main arm64 libpipeline1 arm64 1.5.7-1 [36.4 kB]
Get: 10 http://deb.debian.org/debian bookworm/main arm64 man-db arm64 2.11.2-2 [1369 kB]
Get: 11 http://deb.debian.org/debian bookworm/main arm64 m4 arm64 1.4.19-3 [276 kB]
Get: 12 http://deb.debian.org/debian bookworm/main arm64 autoconf all 2.71-3 [332 kB]
Get: 13 http://deb.debian.org/debian bookworm/main arm64 autotools-dev all 20220109.1 [51.6 kB]
Get: 14 http://deb.debian.org/debian bookworm/main arm64 automake all 1:1.16.5-1.3 [823 kB]
Get: 15 http://deb.debian.org/debian bookworm/main arm64 autopoint all 0.21-12 [495 kB]
Get: 16 http://deb.debian.org/debian bookworm/main arm64 libdebhelper-perl all 13.11.4 [81.2 kB]
Get: 17 http://deb.debian.org/debian bookworm/main arm64 libtool all 2.4.7-5 [517 kB]
Get: 18 http://deb.debian.org/debian bookworm/main arm64 dh-autoreconf all 20 [17.1 kB]
Get: 19 http://deb.debian.org/debian bookworm/main arm64 libarchive-zip-perl all 1.68-1 [104 kB]
Get: 20 http://deb.debian.org/debian bookworm/main arm64 libsub-override-perl all 0.09-4 [9304 B]
Get: 21 http://deb.debian.org/debian bookworm/main arm64 libfile-stripnondeterminism-perl all 1.13.1-1 [19.4 kB]
Get: 22 http://deb.debian.org/debian bookworm/main arm64 dh-strip-nondeterminism all 1.13.1-1 [8620 B]
Get: 23 http://deb.debian.org/debian bookworm/main arm64 libelf1 arm64 0.188-2.1 [173 kB]
Get: 24 http://deb.debian.org/debian bookworm/main arm64 dwz arm64 0.15-1 [101 kB]
Get: 25 http://deb.debian.org/debian bookworm/main arm64 libicu72 arm64 72.1-3 [9204 kB]
Get: 26 http://deb.debian.org/debian bookworm/main arm64 libxml2 arm64 2.9.14+dfsg-1.3~deb12u1 [619 kB]
Get: 27 http://deb.debian.org/debian bookworm/main arm64 gettext arm64 0.21-12 [1248 kB]
Get: 28 http://deb.debian.org/debian bookworm/main arm64 intltool-debian all 0.35.0+20060710.6 [22.9 kB]
Get: 29 http://deb.debian.org/debian bookworm/main arm64 po-debconf all 1.0.21+nmu1 [248 kB]
Get: 30 http://deb.debian.org/debian bookworm/main arm64 debhelper all 13.11.4 [942 kB]
Get: 31 http://deb.debian.org/debian bookworm/main arm64 libarchive13 arm64 3.6.2-1 [316 kB]
Get: 32 http://deb.debian.org/debian bookworm/main arm64 libarchive-dev arm64 3.6.2-1 [542 kB]
Get: 33 http://deb.debian.org/debian bookworm/main arm64 libjudydebian1 arm64 1.0.5-5+b2 [100 kB]
Get: 34 http://deb.debian.org/debian bookworm/main arm64 libjudy-dev arm64 1.0.5-5+b2 [139 kB]
Get: 35 http://deb.debian.org/debian bookworm/main arm64 libpkgconf3 arm64 1.8.1-1 [35.3 kB]
Get: 36 http://deb.debian.org/debian bookworm/main arm64 pkgconf-bin arm64 1.8.1-1 [28.9 kB]
Get: 37 http://deb.debian.org/debian bookworm/main arm64 pkgconf arm64 1.8.1-1 [25.9 kB]
Get: 38 http://deb.debian.org/debian bookworm/main arm64 pkg-config arm64 1.8.1-1 [13.7 kB]
Fetched 19.5 MB in 0s (63.5 MB/s)
debconf: delaying package configuration, since apt-utils is not installed
Selecting previously unselected package sensible-utils.
(Reading database ... 
(Reading database ... 5%
(Reading database ... 10%
(Reading database ... 15%
(Reading database ... 20%
(Reading database ... 25%
(Reading database ... 30%
(Reading database ... 35%
(Reading database ... 40%
(Reading database ... 45%
(Reading database ... 50%
(Reading database ... 55%
(Reading database ... 60%
(Reading database ... 65%
(Reading database ... 70%
(Reading database ... 75%
(Reading database ... 80%
(Reading database ... 85%
(Reading database ... 90%
(Reading database ... 95%
(Reading database ... 100%
(Reading database ... 18171 files and directories currently installed.)
Preparing to unpack .../00-sensible-utils_0.0.17+nmu1_all.deb ...
Unpacking sensible-utils (0.0.17+nmu1) ...
Selecting previously unselected package libmagic-mgc.
Preparing to unpack .../01-libmagic-mgc_1%3a5.44-3_arm64.deb ...
Unpacking libmagic-mgc (1:5.44-3) ...
Selecting previously unselected package libmagic1:arm64.
Preparing to unpack .../02-libmagic1_1%3a5.44-3_arm64.deb ...
Unpacking libmagic1:arm64 (1:5.44-3) ...
Selecting previously unselected package file.
Preparing to unpack .../03-file_1%3a5.44-3_arm64.deb ...
Unpacking file (1:5.44-3) ...
Selecting previously unselected package gettext-base.
Preparing to unpack .../04-gettext-base_0.21-12_arm64.deb ...
Unpacking gettext-base (0.21-12) ...
Selecting previously unselected package libuchardet0:arm64.
Preparing to unpack .../05-libuchardet0_0.0.7-1_arm64.deb ...
Unpacking libuchardet0:arm64 (0.0.7-1) ...
Selecting previously unselected package groff-base.
Preparing to unpack .../06-groff-base_1.22.4-10_arm64.deb ...
Unpacking groff-base (1.22.4-10) ...
Selecting previously unselected package bsdextrautils.
Preparing to unpack .../07-bsdextrautils_2.38.1-5+b1_arm64.deb ...
Unpacking bsdextrautils (2.38.1-5+b1) ...
Selecting previously unselected package libpipeline1:arm64.
Preparing to unpack .../08-libpipeline1_1.5.7-1_arm64.deb ...
Unpacking libpipeline1:arm64 (1.5.7-1) ...
Selecting previously unselected package man-db.
Preparing to unpack .../09-man-db_2.11.2-2_arm64.deb ...
Unpacking man-db (2.11.2-2) ...
Selecting previously unselected package m4.
Preparing to unpack .../10-m4_1.4.19-3_arm64.deb ...
Unpacking m4 (1.4.19-3) ...
Selecting previously unselected package autoconf.
Preparing to unpack .../11-autoconf_2.71-3_all.deb ...
Unpacking autoconf (2.71-3) ...
Selecting previously unselected package autotools-dev.
Preparing to unpack .../12-autotools-dev_20220109.1_all.deb ...
Unpacking autotools-dev (20220109.1) ...
Selecting previously unselected package automake.
Preparing to unpack .../13-automake_1%3a1.16.5-1.3_all.deb ...
Unpacking automake (1:1.16.5-1.3) ...
Selecting previously unselected package autopoint.
Preparing to unpack .../14-autopoint_0.21-12_all.deb ...
Unpacking autopoint (0.21-12) ...
Selecting previously unselected package libdebhelper-perl.
Preparing to unpack .../15-libdebhelper-perl_13.11.4_all.deb ...
Unpacking libdebhelper-perl (13.11.4) ...
Selecting previously unselected package libtool.
Preparing to unpack .../16-libtool_2.4.7-5_all.deb ...
Unpacking libtool (2.4.7-5) ...
Selecting previously unselected package dh-autoreconf.
Preparing to unpack .../17-dh-autoreconf_20_all.deb ...
Unpacking dh-autoreconf (20) ...
Selecting previously unselected package libarchive-zip-perl.
Preparing to unpack .../18-libarchive-zip-perl_1.68-1_all.deb ...
Unpacking libarchive-zip-perl (1.68-1) ...
Selecting previously unselected package libsub-override-perl.
Preparing to unpack .../19-libsub-override-perl_0.09-4_all.deb ...
Unpacking libsub-override-perl (0.09-4) ...
Selecting previously unselected package libfile-stripnondeterminism-perl.
Preparing to unpack .../20-libfile-stripnondeterminism-perl_1.13.1-1_all.deb ...
Unpacking libfile-stripnondeterminism-perl (1.13.1-1) ...
Selecting previously unselected package dh-strip-nondeterminism.
Preparing to unpack .../21-dh-strip-nondeterminism_1.13.1-1_all.deb ...
Unpacking dh-strip-nondeterminism (1.13.1-1) ...
Selecting previously unselected package libelf1:arm64.
Preparing to unpack .../22-libelf1_0.188-2.1_arm64.deb ...
Unpacking libelf1:arm64 (0.188-2.1) ...
Selecting previously unselected package dwz.
Preparing to unpack .../23-dwz_0.15-1_arm64.deb ...
Unpacking dwz (0.15-1) ...
Selecting previously unselected package libicu72:arm64.
Preparing to unpack .../24-libicu72_72.1-3_arm64.deb ...
Unpacking libicu72:arm64 (72.1-3) ...
Selecting previously unselected package libxml2:arm64.
Preparing to unpack .../25-libxml2_2.9.14+dfsg-1.3~deb12u1_arm64.deb ...
Unpacking libxml2:arm64 (2.9.14+dfsg-1.3~deb12u1) ...
Selecting previously unselected package gettext.
Preparing to unpack .../26-gettext_0.21-12_arm64.deb ...
Unpacking gettext (0.21-12) ...
Selecting previously unselected package intltool-debian.
Preparing to unpack .../27-intltool-debian_0.35.0+20060710.6_all.deb ...
Unpacking intltool-debian (0.35.0+20060710.6) ...
Selecting previously unselected package po-debconf.
Preparing to unpack .../28-po-debconf_1.0.21+nmu1_all.deb ...
Unpacking po-debconf (1.0.21+nmu1) ...
Selecting previously unselected package debhelper.
Preparing to unpack .../29-debhelper_13.11.4_all.deb ...
Unpacking debhelper (13.11.4) ...
Selecting previously unselected package libarchive13:arm64.
Preparing to unpack .../30-libarchive13_3.6.2-1_arm64.deb ...
Unpacking libarchive13:arm64 (3.6.2-1) ...
Selecting previously unselected package libarchive-dev:arm64.
Preparing to unpack .../31-libarchive-dev_3.6.2-1_arm64.deb ...
Unpacking libarchive-dev:arm64 (3.6.2-1) ...
Selecting previously unselected package libjudydebian1.
Preparing to unpack .../32-libjudydebian1_1.0.5-5+b2_arm64.deb ...
Unpacking libjudydebian1 (1.0.5-5+b2) ...
Selecting previously unselected package libjudy-dev.
Preparing to unpack .../33-libjudy-dev_1.0.5-5+b2_arm64.deb ...
Unpacking libjudy-dev (1.0.5-5+b2) ...
Selecting previously unselected package libpkgconf3:arm64.
Preparing to unpack .../34-libpkgconf3_1.8.1-1_arm64.deb ...
Unpacking libpkgconf3:arm64 (1.8.1-1) ...
Selecting previously unselected package pkgconf-bin.
Preparing to unpack .../35-pkgconf-bin_1.8.1-1_arm64.deb ...
Unpacking pkgconf-bin (1.8.1-1) ...
Selecting previously unselected package pkgconf:arm64.
Preparing to unpack .../36-pkgconf_1.8.1-1_arm64.deb ...
Unpacking pkgconf:arm64 (1.8.1-1) ...
Selecting previously unselected package pkg-config:arm64.
Preparing to unpack .../37-pkg-config_1.8.1-1_arm64.deb ...
Unpacking pkg-config:arm64 (1.8.1-1) ...
Setting up libpipeline1:arm64 (1.5.7-1) ...
Setting up libicu72:arm64 (72.1-3) ...
Setting up bsdextrautils (2.38.1-5+b1) ...
Setting up libmagic-mgc (1:5.44-3) ...
Setting up libarchive-zip-perl (1.68-1) ...
Setting up libdebhelper-perl (13.11.4) ...
Setting up libmagic1:arm64 (1:5.44-3) ...
Setting up gettext-base (0.21-12) ...
Setting up m4 (1.4.19-3) ...
Setting up file (1:5.44-3) ...
Setting up libjudydebian1 (1.0.5-5+b2) ...
Setting up autotools-dev (20220109.1) ...
Setting up libjudy-dev (1.0.5-5+b2) ...
Setting up libpkgconf3:arm64 (1.8.1-1) ...
Setting up autopoint (0.21-12) ...
Setting up pkgconf-bin (1.8.1-1) ...
Setting up autoconf (2.71-3) ...
Setting up sensible-utils (0.0.17+nmu1) ...
Setting up libuchardet0:arm64 (0.0.7-1) ...
Setting up libsub-override-perl (0.09-4) ...
Setting up libelf1:arm64 (0.188-2.1) ...
Setting up libxml2:arm64 (2.9.14+dfsg-1.3~deb12u1) ...
Setting up automake (1:1.16.5-1.3) ...
update-alternatives: using /usr/bin/automake-1.16 to provide /usr/bin/automake (automake) in auto mode
Setting up libfile-stripnondeterminism-perl (1.13.1-1) ...
Setting up gettext (0.21-12) ...
Setting up libtool (2.4.7-5) ...
Setting up libarchive13:arm64 (3.6.2-1) ...
Setting up pkgconf:arm64 (1.8.1-1) ...
Setting up intltool-debian (0.35.0+20060710.6) ...
Setting up dh-autoreconf (20) ...
Setting up pkg-config:arm64 (1.8.1-1) ...
Setting up dh-strip-nondeterminism (1.13.1-1) ...
Setting up dwz (0.15-1) ...
Setting up groff-base (1.22.4-10) ...
Setting up libarchive-dev:arm64 (3.6.2-1) ...
Setting up po-debconf (1.0.21+nmu1) ...
Setting up man-db (2.11.2-2) ...
Not building database; man-db/auto-update is not 'true'.
Setting up debhelper (13.11.4) ...
Processing triggers for libc-bin (2.36-9+deb12u3) ...
Reading package lists...
Building dependency tree...
Reading state information...
Reading extended state information...
Initializing package states...
Writing extended state information...
Building tag database...
 -> Finished parsing the build-deps
Reading package lists...
Building dependency tree...
Reading state information...
fakeroot is already the newest version (1.31-1.2).
0 upgraded, 0 newly installed, 0 to remove and 0 not upgraded.
I: Building the package
I: Running cd /build/reproducible-path/traildb-0.6+dfsg1/ && env PATH="/usr/sbin:/usr/bin:/sbin:/bin:/usr/games" HOME="/nonexistent/first-build" dpkg-buildpackage -us -uc -b && env PATH="/usr/sbin:/usr/bin:/sbin:/bin:/usr/games" HOME="/nonexistent/first-build" dpkg-genchanges -S  > ../traildb_0.6+dfsg1-1_source.changes
dpkg-buildpackage: info: source package traildb
dpkg-buildpackage: info: source version 0.6+dfsg1-1
dpkg-buildpackage: info: source distribution unstable
dpkg-buildpackage: info: source changed by ChangZhuo Chen (陳昌倬) <czchen@debian.org>
 dpkg-source --before-build .
dpkg-buildpackage: info: host architecture arm64
 fakeroot debian/rules clean
dh clean
   dh_clean
 debian/rules build
dh build
   dh_update_autotools_config
   dh_autoreconf
aclocal: warning: couldn't open directory 'm4': No such file or directory
libtoolize: putting auxiliary files in '.'.
libtoolize: copying file './ltmain.sh'
libtoolize: putting macros in AC_CONFIG_MACRO_DIRS, 'm4'.
libtoolize: copying file 'm4/libtool.m4'
libtoolize: copying file 'm4/ltoptions.m4'
libtoolize: copying file 'm4/ltsugar.m4'
libtoolize: copying file 'm4/ltversion.m4'
libtoolize: copying file 'm4/lt~obsolete.m4'
configure.ac:5: installing './ar-lib'
configure.ac:5: installing './compile'
configure.ac:6: installing './config.guess'
configure.ac:6: installing './config.sub'
configure.ac:4: installing './install-sh'
configure.ac:4: installing './missing'
Makefile.am: installing './depcomp'
   dh_auto_configure
	./configure --build=aarch64-linux-gnu --prefix=/usr --includedir=\${prefix}/include --mandir=\${prefix}/share/man --infodir=\${prefix}/share/info --sysconfdir=/etc --localstatedir=/var --disable-option-checking --disable-silent-rules --libdir=\${prefix}/lib/aarch64-linux-gnu --libexecdir=\${prefix}/lib/aarch64-linux-gnu --disable-maintainer-mode --disable-dependency-tracking
checking for a BSD-compatible install... /usr/bin/install -c
checking whether build environment is sane... yes
checking for a race-free mkdir -p... /bin/mkdir -p
checking for gawk... no
checking for mawk... mawk
checking whether make sets $(MAKE)... yes
checking whether make supports nested variables... yes
checking whether make supports the include directive... yes (GNU style)
checking for gcc... gcc
checking whether the C compiler works... yes
checking for C compiler default output file name... a.out
checking for suffix of executables... 
checking whether we are cross compiling... no
checking for suffix of object files... o
checking whether the compiler supports GNU C... yes
checking whether gcc accepts -g... yes
checking for gcc option to enable C11 features... none needed
checking whether gcc understands -c and -o together... yes
checking dependency style of gcc... none
checking for ar... ar
checking the archiver (ar) interface... ar
checking build system type... aarch64-unknown-linux-gnu
checking host system type... aarch64-unknown-linux-gnu
checking how to print strings... printf
checking for a sed that does not truncate output... /bin/sed
checking for grep that handles long lines and -e... /bin/grep
checking for egrep... /bin/grep -E
checking for fgrep... /bin/grep -F
checking for ld used by gcc... /usr/bin/ld
checking if the linker (/usr/bin/ld) is GNU ld... yes
checking for BSD- or MS-compatible name lister (nm)... /usr/bin/nm -B
checking the name lister (/usr/bin/nm -B) interface... BSD nm
checking whether ln -s works... yes
checking the maximum length of command line arguments... 1572864
checking how to convert aarch64-unknown-linux-gnu file names to aarch64-unknown-linux-gnu format... func_convert_file_noop
checking how to convert aarch64-unknown-linux-gnu file names to toolchain format... func_convert_file_noop
checking for /usr/bin/ld option to reload object files... -r
checking for file... file
checking for objdump... objdump
checking how to recognize dependent libraries... pass_all
checking for dlltool... no
checking how to associate runtime and link libraries... printf %s\n
checking for archiver @FILE support... @
checking for strip... strip
checking for ranlib... ranlib
checking command to parse /usr/bin/nm -B output from gcc object... ok
checking for sysroot... no
checking for a working dd... /bin/dd
checking how to truncate binary pipes... /bin/dd bs=4096 count=1
checking for mt... no
checking if : is a manifest tool... no
checking for stdio.h... yes
checking for stdlib.h... yes
checking for string.h... yes
checking for inttypes.h... yes
checking for stdint.h... yes
checking for strings.h... yes
checking for sys/stat.h... yes
checking for sys/types.h... yes
checking for unistd.h... yes
checking for dlfcn.h... yes
checking for objdir... .libs
checking if gcc supports -fno-rtti -fno-exceptions... no
checking for gcc option to produce PIC... -fPIC -DPIC
checking if gcc PIC flag -fPIC -DPIC works... yes
checking if gcc static flag -static works... yes
checking if gcc supports -c -o file.o... yes
checking if gcc supports -c -o file.o... (cached) yes
checking whether the gcc linker (/usr/bin/ld) supports shared libraries... yes
checking whether -lc should be explicitly linked in... no
checking dynamic linker characteristics... GNU/Linux ld.so
checking how to hardcode library paths into programs... immediate
checking whether stripping libraries is possible... yes
checking if libtool supports shared libraries... yes
checking whether to build shared libraries... yes
checking whether to build static libraries... yes
checking for gcc... (cached) gcc
checking whether the compiler supports GNU C... (cached) yes
checking whether gcc accepts -g... (cached) yes
checking for gcc option to enable C11 features... (cached) none needed
checking whether gcc understands -c and -o together... (cached) yes
checking dependency style of gcc... (cached) none
checking for JudyHSIns in -lJudy... yes
checking for Judy.h... yes
checking that Judy is not broken... not broken
checking for archive.h... yes
checking for archive_write_new in -larchive... yes
checking for __uint128_t... yes
checking size of off_t... 8
checking size of size_t... 8
checking that generated files are newer than configure... done
configure: creating ./config.status
config.status: creating Makefile
config.status: executing depfiles commands
config.status: executing libtool commands
   dh_auto_build
	make -j12
make[1]: Entering directory '/build/reproducible-path/traildb-0.6+dfsg1'
/bin/bash ./libtool  --tag=CC   --mode=compile gcc -DPACKAGE_NAME=\"traildb\" -DPACKAGE_TARNAME=\"traildb\" -DPACKAGE_VERSION=\"0.6\" -DPACKAGE_STRING=\"traildb\ 0.6\" -DPACKAGE_BUGREPORT=\"ville@adroll.com\" -DPACKAGE_URL=\"\" -DPACKAGE=\"traildb\" -DVERSION=\"0.6\" -DHAVE_STDIO_H=1 -DHAVE_STDLIB_H=1 -DHAVE_STRING_H=1 -DHAVE_INTTYPES_H=1 -DHAVE_STDINT_H=1 -DHAVE_STRINGS_H=1 -DHAVE_SYS_STAT_H=1 -DHAVE_SYS_TYPES_H=1 -DHAVE_UNISTD_H=1 -DSTDC_HEADERS=1 -DHAVE_DLFCN_H=1 -DLT_OBJDIR=\".libs/\" -DDSFMT_MEXP=521 -DHAVE_SSE2=1 -DHAVE_LIBJUDY=1 -DHAVE_JUDY_H=1 -DHAVE_ARCHIVE_H=1 -DHAVE_LIBARCHIVE=1 -DSIZEOF_OFF_T=8 -DSIZEOF_SIZE_T=8 -I.  -Isrc/xxhash -Isrc/dsfmt -Wdate-time -D_FORTIFY_SOURCE=2 -O3 -g -fvisibility=hidden -g -O2 -ffile-prefix-map=/build/reproducible-path/traildb-0.6+dfsg1=. -fstack-protector-strong -Wformat -Werror=format-security -Wall -pedantic -c -o src/xxhash/xxhash.lo src/xxhash/xxhash.c
/bin/bash ./libtool  --tag=CC   --mode=compile gcc -DPACKAGE_NAME=\"traildb\" -DPACKAGE_TARNAME=\"traildb\" -DPACKAGE_VERSION=\"0.6\" -DPACKAGE_STRING=\"traildb\ 0.6\" -DPACKAGE_BUGREPORT=\"ville@adroll.com\" -DPACKAGE_URL=\"\" -DPACKAGE=\"traildb\" -DVERSION=\"0.6\" -DHAVE_STDIO_H=1 -DHAVE_STDLIB_H=1 -DHAVE_STRING_H=1 -DHAVE_INTTYPES_H=1 -DHAVE_STDINT_H=1 -DHAVE_STRINGS_H=1 -DHAVE_SYS_STAT_H=1 -DHAVE_SYS_TYPES_H=1 -DHAVE_UNISTD_H=1 -DSTDC_HEADERS=1 -DHAVE_DLFCN_H=1 -DLT_OBJDIR=\".libs/\" -DDSFMT_MEXP=521 -DHAVE_SSE2=1 -DHAVE_LIBJUDY=1 -DHAVE_JUDY_H=1 -DHAVE_ARCHIVE_H=1 -DHAVE_LIBARCHIVE=1 -DSIZEOF_OFF_T=8 -DSIZEOF_SIZE_T=8 -I.  -Isrc/xxhash -Isrc/dsfmt -Wdate-time -D_FORTIFY_SOURCE=2 -O3 -g -fvisibility=hidden -g -O2 -ffile-prefix-map=/build/reproducible-path/traildb-0.6+dfsg1=. -fstack-protector-strong -Wformat -Werror=format-security -Wall -pedantic -c -o src/dsfmt/dSFMT.lo src/dsfmt/dSFMT.c
gcc -DPACKAGE_NAME=\"traildb\" -DPACKAGE_TARNAME=\"traildb\" -DPACKAGE_VERSION=\"0.6\" -DPACKAGE_STRING=\"traildb\ 0.6\" -DPACKAGE_BUGREPORT=\"ville@adroll.com\" -DPACKAGE_URL=\"\" -DPACKAGE=\"traildb\" -DVERSION=\"0.6\" -DHAVE_STDIO_H=1 -DHAVE_STDLIB_H=1 -DHAVE_STRING_H=1 -DHAVE_INTTYPES_H=1 -DHAVE_STDINT_H=1 -DHAVE_STRINGS_H=1 -DHAVE_SYS_STAT_H=1 -DHAVE_SYS_TYPES_H=1 -DHAVE_UNISTD_H=1 -DSTDC_HEADERS=1 -DHAVE_DLFCN_H=1 -DLT_OBJDIR=\".libs/\" -DDSFMT_MEXP=521 -DHAVE_SSE2=1 -DHAVE_LIBJUDY=1 -DHAVE_JUDY_H=1 -DHAVE_ARCHIVE_H=1 -DHAVE_LIBARCHIVE=1 -DSIZEOF_OFF_T=8 -DSIZEOF_SIZE_T=8 -I.  -Isrc/xxhash -Isrc/dsfmt -Wdate-time -D_FORTIFY_SOURCE=2 -Isrc/ -O3 -g -Wall -g -O2 -ffile-prefix-map=/build/reproducible-path/traildb-0.6+dfsg1=. -fstack-protector-strong -Wformat -Werror=format-security -Wall -pedantic -c -o tdbcli/tdb-thread_util.o `test -f 'tdbcli/thread_util.c' || echo './'`tdbcli/thread_util.c
gcc -DPACKAGE_NAME=\"traildb\" -DPACKAGE_TARNAME=\"traildb\" -DPACKAGE_VERSION=\"0.6\" -DPACKAGE_STRING=\"traildb\ 0.6\" -DPACKAGE_BUGREPORT=\"ville@adroll.com\" -DPACKAGE_URL=\"\" -DPACKAGE=\"traildb\" -DVERSION=\"0.6\" -DHAVE_STDIO_H=1 -DHAVE_STDLIB_H=1 -DHAVE_STRING_H=1 -DHAVE_INTTYPES_H=1 -DHAVE_STDINT_H=1 -DHAVE_STRINGS_H=1 -DHAVE_SYS_STAT_H=1 -DHAVE_SYS_TYPES_H=1 -DHAVE_UNISTD_H=1 -DSTDC_HEADERS=1 -DHAVE_DLFCN_H=1 -DLT_OBJDIR=\".libs/\" -DDSFMT_MEXP=521 -DHAVE_SSE2=1 -DHAVE_LIBJUDY=1 -DHAVE_JUDY_H=1 -DHAVE_ARCHIVE_H=1 -DHAVE_LIBARCHIVE=1 -DSIZEOF_OFF_T=8 -DSIZEOF_SIZE_T=8 -I.  -Isrc/xxhash -Isrc/dsfmt -Wdate-time -D_FORTIFY_SOURCE=2 -Isrc/ -O3 -g -Wall -g -O2 -ffile-prefix-map=/build/reproducible-path/traildb-0.6+dfsg1=. -fstack-protector-strong -Wformat -Werror=format-security -Wall -pedantic -c -o tdbcli/tdb-filter.o `test -f 'tdbcli/filter.c' || echo './'`tdbcli/filter.c
gcc -DPACKAGE_NAME=\"traildb\" -DPACKAGE_TARNAME=\"traildb\" -DPACKAGE_VERSION=\"0.6\" -DPACKAGE_STRING=\"traildb\ 0.6\" -DPACKAGE_BUGREPORT=\"ville@adroll.com\" -DPACKAGE_URL=\"\" -DPACKAGE=\"traildb\" -DVERSION=\"0.6\" -DHAVE_STDIO_H=1 -DHAVE_STDLIB_H=1 -DHAVE_STRING_H=1 -DHAVE_INTTYPES_H=1 -DHAVE_STDINT_H=1 -DHAVE_STRINGS_H=1 -DHAVE_SYS_STAT_H=1 -DHAVE_SYS_TYPES_H=1 -DHAVE_UNISTD_H=1 -DSTDC_HEADERS=1 -DHAVE_DLFCN_H=1 -DLT_OBJDIR=\".libs/\" -DDSFMT_MEXP=521 -DHAVE_SSE2=1 -DHAVE_LIBJUDY=1 -DHAVE_JUDY_H=1 -DHAVE_ARCHIVE_H=1 -DHAVE_LIBARCHIVE=1 -DSIZEOF_OFF_T=8 -DSIZEOF_SIZE_T=8 -I.  -Isrc/xxhash -Isrc/dsfmt -Wdate-time -D_FORTIFY_SOURCE=2 -Isrc/ -O3 -g -Wall -g -O2 -ffile-prefix-map=/build/reproducible-path/traildb-0.6+dfsg1=. -fstack-protector-strong -Wformat -Werror=format-security -Wall -pedantic -c -o tdbcli/tdb-op_index.o `test -f 'tdbcli/op_index.c' || echo './'`tdbcli/op_index.c
In file included from src/traildb.h:9,
                 from tdbcli/tdbcli.h:9,
                 from tdbcli/thread_util.c:8:
src/tdb_types.h:51:20: warning: ISO C forbids zero-size array 'items' [-Wpedantic]
   51 |     const tdb_item items[0];
      |                    ^~~~~
gcc -DPACKAGE_NAME=\"traildb\" -DPACKAGE_TARNAME=\"traildb\" -DPACKAGE_VERSION=\"0.6\" -DPACKAGE_STRING=\"traildb\ 0.6\" -DPACKAGE_BUGREPORT=\"ville@adroll.com\" -DPACKAGE_URL=\"\" -DPACKAGE=\"traildb\" -DVERSION=\"0.6\" -DHAVE_STDIO_H=1 -DHAVE_STDLIB_H=1 -DHAVE_STRING_H=1 -DHAVE_INTTYPES_H=1 -DHAVE_STDINT_H=1 -DHAVE_STRINGS_H=1 -DHAVE_SYS_STAT_H=1 -DHAVE_SYS_TYPES_H=1 -DHAVE_UNISTD_H=1 -DSTDC_HEADERS=1 -DHAVE_DLFCN_H=1 -DLT_OBJDIR=\".libs/\" -DDSFMT_MEXP=521 -DHAVE_SSE2=1 -DHAVE_LIBJUDY=1 -DHAVE_JUDY_H=1 -DHAVE_ARCHIVE_H=1 -DHAVE_LIBARCHIVE=1 -DSIZEOF_OFF_T=8 -DSIZEOF_SIZE_T=8 -I.  -Isrc/xxhash -Isrc/dsfmt -Wdate-time -D_FORTIFY_SOURCE=2 -std=c99 -DJUDYERROR=judyerror_macro_missing_fix_this -O3 -fvisibility=hidden -g -Wall -Wextra -Wconversion -Wcast-qual -Wformat-security -Wmissing-declarations -Wmissing-prototypes -Wnested-externs -Wpointer-arith -Wshadow -Wstrict-prototypes -Isrc/ -g -O2 -ffile-prefix-map=/build/reproducible-path/traildb-0.6+dfsg1=. -fstack-protector-strong -Wformat -Werror=format-security -Wall -pedantic -c -o util/traildb_bench-traildb_bench.o `test -f 'util/traildb_bench.c' || echo './'`util/traildb_bench.c
/bin/bash ./libtool  --tag=CC   --mode=compile gcc -DPACKAGE_NAME=\"traildb\" -DPACKAGE_TARNAME=\"traildb\" -DPACKAGE_VERSION=\"0.6\" -DPACKAGE_STRING=\"traildb\ 0.6\" -DPACKAGE_BUGREPORT=\"ville@adroll.com\" -DPACKAGE_URL=\"\" -DPACKAGE=\"traildb\" -DVERSION=\"0.6\" -DHAVE_STDIO_H=1 -DHAVE_STDLIB_H=1 -DHAVE_STRING_H=1 -DHAVE_INTTYPES_H=1 -DHAVE_STDINT_H=1 -DHAVE_STRINGS_H=1 -DHAVE_SYS_STAT_H=1 -DHAVE_SYS_TYPES_H=1 -DHAVE_UNISTD_H=1 -DSTDC_HEADERS=1 -DHAVE_DLFCN_H=1 -DLT_OBJDIR=\".libs/\" -DDSFMT_MEXP=521 -DHAVE_SSE2=1 -DHAVE_LIBJUDY=1 -DHAVE_JUDY_H=1 -DHAVE_ARCHIVE_H=1 -DHAVE_LIBARCHIVE=1 -DSIZEOF_OFF_T=8 -DSIZEOF_SIZE_T=8 -I.  -Isrc/xxhash -Isrc/dsfmt -Wdate-time -D_FORTIFY_SOURCE=2 -std=c99 -DJUDYERROR=judyerror_macro_missing_fix_this -O3 -fvisibility=hidden -g -Wall -Wextra -Wconversion -Wcast-qual -Wformat-security -Wmissing-declarations -Wmissing-prototypes -Wnested-externs -Wpointer-arith -Wshadow -Wstrict-prototypes -g -O2 -ffile-prefix-map=/build/reproducible-path/traildb-0.6+dfsg1=. -fstack-protector-strong -Wformat -Werror=format-security -Wall -pedantic -c -o src/libtraildb_la-tdb.lo `test -f 'src/tdb.c' || echo './'`src/tdb.c
In file included from src/traildb.h:9,
                 from tdbcli/filter.c:14:
src/tdb_types.h:51:20: warning: ISO C forbids zero-size array 'items' [-Wpedantic]
   51 |     const tdb_item items[0];
      |                    ^~~~~
tdbcli/filter.c: In function 'apply_uuid':
tdbcli/filter.c:152:47: warning: pointer targets in passing argument 1 of 'tdb_uuid_raw' differ in signedness [-Wpointer-sign]
  152 |     if (strlen(uuidstr) != 32 || tdb_uuid_raw(uuidstr, uuid)){
      |                                               ^~~~~~~
      |                                               |
      |                                               const char *
src/traildb.h:166:38: note: expected 'const uint8_t *' {aka 'const unsigned char *'} but argument is of type 'const char *'
  166 | tdb_error tdb_uuid_raw(const uint8_t hexuuid[32], uint8_t uuid[16]);
      |                        ~~~~~~~~~~~~~~^~~~~~~~~~~
/bin/bash ./libtool  --tag=CC   --mode=compile gcc -DPACKAGE_NAME=\"traildb\" -DPACKAGE_TARNAME=\"traildb\" -DPACKAGE_VERSION=\"0.6\" -DPACKAGE_STRING=\"traildb\ 0.6\" -DPACKAGE_BUGREPORT=\"ville@adroll.com\" -DPACKAGE_URL=\"\" -DPACKAGE=\"traildb\" -DVERSION=\"0.6\" -DHAVE_STDIO_H=1 -DHAVE_STDLIB_H=1 -DHAVE_STRING_H=1 -DHAVE_INTTYPES_H=1 -DHAVE_STDINT_H=1 -DHAVE_STRINGS_H=1 -DHAVE_SYS_STAT_H=1 -DHAVE_SYS_TYPES_H=1 -DHAVE_UNISTD_H=1 -DSTDC_HEADERS=1 -DHAVE_DLFCN_H=1 -DLT_OBJDIR=\".libs/\" -DDSFMT_MEXP=521 -DHAVE_SSE2=1 -DHAVE_LIBJUDY=1 -DHAVE_JUDY_H=1 -DHAVE_ARCHIVE_H=1 -DHAVE_LIBARCHIVE=1 -DSIZEOF_OFF_T=8 -DSIZEOF_SIZE_T=8 -I.  -Isrc/xxhash -Isrc/dsfmt -Wdate-time -D_FORTIFY_SOURCE=2 -std=c99 -DJUDYERROR=judyerror_macro_missing_fix_this -O3 -fvisibility=hidden -g -Wall -Wextra -Wconversion -Wcast-qual -Wformat-security -Wmissing-declarations -Wmissing-prototypes -Wnested-externs -Wpointer-arith -Wshadow -Wstrict-prototypes -g -O2 -ffile-prefix-map=/build/reproducible-path/traildb-0.6+dfsg1=. -fstack-protector-strong -Wformat -Werror=format-security -Wall -pedantic -c -o src/libtraildb_la-tdb_cons.lo `test -f 'src/tdb_cons.c' || echo './'`src/tdb_cons.c
/bin/bash ./libtool  --tag=CC   --mode=compile gcc -DPACKAGE_NAME=\"traildb\" -DPACKAGE_TARNAME=\"traildb\" -DPACKAGE_VERSION=\"0.6\" -DPACKAGE_STRING=\"traildb\ 0.6\" -DPACKAGE_BUGREPORT=\"ville@adroll.com\" -DPACKAGE_URL=\"\" -DPACKAGE=\"traildb\" -DVERSION=\"0.6\" -DHAVE_STDIO_H=1 -DHAVE_STDLIB_H=1 -DHAVE_STRING_H=1 -DHAVE_INTTYPES_H=1 -DHAVE_STDINT_H=1 -DHAVE_STRINGS_H=1 -DHAVE_SYS_STAT_H=1 -DHAVE_SYS_TYPES_H=1 -DHAVE_UNISTD_H=1 -DSTDC_HEADERS=1 -DHAVE_DLFCN_H=1 -DLT_OBJDIR=\".libs/\" -DDSFMT_MEXP=521 -DHAVE_SSE2=1 -DHAVE_LIBJUDY=1 -DHAVE_JUDY_H=1 -DHAVE_ARCHIVE_H=1 -DHAVE_LIBARCHIVE=1 -DSIZEOF_OFF_T=8 -DSIZEOF_SIZE_T=8 -I.  -Isrc/xxhash -Isrc/dsfmt -Wdate-time -D_FORTIFY_SOURCE=2 -std=c99 -DJUDYERROR=judyerror_macro_missing_fix_this -O3 -fvisibility=hidden -g -Wall -Wextra -Wconversion -Wcast-qual -Wformat-security -Wmissing-declarations -Wmissing-prototypes -Wnested-externs -Wpointer-arith -Wshadow -Wstrict-prototypes -g -O2 -ffile-prefix-map=/build/reproducible-path/traildb-0.6+dfsg1=. -fstack-protector-strong -Wformat -Werror=format-security -Wall -pedantic -c -o src/libtraildb_la-tdb_uuid.lo `test -f 'src/tdb_uuid.c' || echo './'`src/tdb_uuid.c
/bin/bash ./libtool  --tag=CC   --mode=compile gcc -DPACKAGE_NAME=\"traildb\" -DPACKAGE_TARNAME=\"traildb\" -DPACKAGE_VERSION=\"0.6\" -DPACKAGE_STRING=\"traildb\ 0.6\" -DPACKAGE_BUGREPORT=\"ville@adroll.com\" -DPACKAGE_URL=\"\" -DPACKAGE=\"traildb\" -DVERSION=\"0.6\" -DHAVE_STDIO_H=1 -DHAVE_STDLIB_H=1 -DHAVE_STRING_H=1 -DHAVE_INTTYPES_H=1 -DHAVE_STDINT_H=1 -DHAVE_STRINGS_H=1 -DHAVE_SYS_STAT_H=1 -DHAVE_SYS_TYPES_H=1 -DHAVE_UNISTD_H=1 -DSTDC_HEADERS=1 -DHAVE_DLFCN_H=1 -DLT_OBJDIR=\".libs/\" -DDSFMT_MEXP=521 -DHAVE_SSE2=1 -DHAVE_LIBJUDY=1 -DHAVE_JUDY_H=1 -DHAVE_ARCHIVE_H=1 -DHAVE_LIBARCHIVE=1 -DSIZEOF_OFF_T=8 -DSIZEOF_SIZE_T=8 -I.  -Isrc/xxhash -Isrc/dsfmt -Wdate-time -D_FORTIFY_SOURCE=2 -std=c99 -DJUDYERROR=judyerror_macro_missing_fix_this -O3 -fvisibility=hidden -g -Wall -Wextra -Wconversion -Wcast-qual -Wformat-security -Wmissing-declarations -Wmissing-prototypes -Wnested-externs -Wpointer-arith -Wshadow -Wstrict-prototypes -g -O2 -ffile-prefix-map=/build/reproducible-path/traildb-0.6+dfsg1=. -fstack-protector-strong -Wformat -Werror=format-security -Wall -pedantic -c -o src/libtraildb_la-tdb_decode.lo `test -f 'src/tdb_decode.c' || echo './'`src/tdb_decode.c
/bin/bash ./libtool  --tag=CC   --mode=compile gcc -DPACKAGE_NAME=\"traildb\" -DPACKAGE_TARNAME=\"traildb\" -DPACKAGE_VERSION=\"0.6\" -DPACKAGE_STRING=\"traildb\ 0.6\" -DPACKAGE_BUGREPORT=\"ville@adroll.com\" -DPACKAGE_URL=\"\" -DPACKAGE=\"traildb\" -DVERSION=\"0.6\" -DHAVE_STDIO_H=1 -DHAVE_STDLIB_H=1 -DHAVE_STRING_H=1 -DHAVE_INTTYPES_H=1 -DHAVE_STDINT_H=1 -DHAVE_STRINGS_H=1 -DHAVE_SYS_STAT_H=1 -DHAVE_SYS_TYPES_H=1 -DHAVE_UNISTD_H=1 -DSTDC_HEADERS=1 -DHAVE_DLFCN_H=1 -DLT_OBJDIR=\".libs/\" -DDSFMT_MEXP=521 -DHAVE_SSE2=1 -DHAVE_LIBJUDY=1 -DHAVE_JUDY_H=1 -DHAVE_ARCHIVE_H=1 -DHAVE_LIBARCHIVE=1 -DSIZEOF_OFF_T=8 -DSIZEOF_SIZE_T=8 -I.  -Isrc/xxhash -Isrc/dsfmt -Wdate-time -D_FORTIFY_SOURCE=2 -std=c99 -DJUDYERROR=judyerror_macro_missing_fix_this -O3 -fvisibility=hidden -g -Wall -Wextra -Wconversion -Wcast-qual -Wformat-security -Wmissing-declarations -Wmissing-prototypes -Wnested-externs -Wpointer-arith -Wshadow -Wstrict-prototypes -g -O2 -ffile-prefix-map=/build/reproducible-path/traildb-0.6+dfsg1=. -fstack-protector-strong -Wformat -Werror=format-security -Wall -pedantic -c -o src/libtraildb_la-tdb_encode.lo `test -f 'src/tdb_encode.c' || echo './'`src/tdb_encode.c
In file included from src/traildb.h:9,
                 from tdbcli/tdb_index.h:7,
                 from tdbcli/op_index.c:9:
src/tdb_types.h:51:20: warning: ISO C forbids zero-size array 'items' [-Wpedantic]
   51 |     const tdb_item items[0];
      |                    ^~~~~
/bin/bash ./libtool  --tag=CC   --mode=compile gcc -DPACKAGE_NAME=\"traildb\" -DPACKAGE_TARNAME=\"traildb\" -DPACKAGE_VERSION=\"0.6\" -DPACKAGE_STRING=\"traildb\ 0.6\" -DPACKAGE_BUGREPORT=\"ville@adroll.com\" -DPACKAGE_URL=\"\" -DPACKAGE=\"traildb\" -DVERSION=\"0.6\" -DHAVE_STDIO_H=1 -DHAVE_STDLIB_H=1 -DHAVE_STRING_H=1 -DHAVE_INTTYPES_H=1 -DHAVE_STDINT_H=1 -DHAVE_STRINGS_H=1 -DHAVE_SYS_STAT_H=1 -DHAVE_SYS_TYPES_H=1 -DHAVE_UNISTD_H=1 -DSTDC_HEADERS=1 -DHAVE_DLFCN_H=1 -DLT_OBJDIR=\".libs/\" -DDSFMT_MEXP=521 -DHAVE_SSE2=1 -DHAVE_LIBJUDY=1 -DHAVE_JUDY_H=1 -DHAVE_ARCHIVE_H=1 -DHAVE_LIBARCHIVE=1 -DSIZEOF_OFF_T=8 -DSIZEOF_SIZE_T=8 -I.  -Isrc/xxhash -Isrc/dsfmt -Wdate-time -D_FORTIFY_SOURCE=2 -std=c99 -DJUDYERROR=judyerror_macro_missing_fix_this -O3 -fvisibility=hidden -g -Wall -Wextra -Wconversion -Wcast-qual -Wformat-security -Wmissing-declarations -Wmissing-prototypes -Wnested-externs -Wpointer-arith -Wshadow -Wstrict-prototypes -g -O2 -ffile-prefix-map=/build/reproducible-path/traildb-0.6+dfsg1=. -fstack-protector-strong -Wformat -Werror=format-security -Wall -pedantic -c -o src/libtraildb_la-tdb_encode_model.lo `test -f 'src/tdb_encode_model.c' || echo './'`src/tdb_encode_model.c
tdbcli/op_index.c: In function 'op_index':
tdbcli/op_index.c:48:50: warning: format '%u' expects argument of type 'unsigned int', but argument 3 has type '__time_t' {aka 'long int'} [-Wformat=]
   48 |     printf("Index created successfully at %s in %u seconds.\n",
      |                                                 ~^
      |                                                  |
      |                                                  unsigned int
      |                                                 %lu
   49 |            out_path,
   50 |            end_time.tv_sec - start_time.tv_sec);
      |            ~~~~~~~~~~~~~~~~~~~~~~~~~~~~~~~~~~~    
      |                            |
      |                            __time_t {aka long int}
tdbcli/op_index.c:17:9: warning: variable 'ret' set but not used [-Wunused-but-set-variable]
   17 |     int ret;
      |         ^~~
In file included from src/traildb.h:9,
                 from util/traildb_bench.c:7:
src/tdb_types.h:51:20: warning: ISO C forbids zero-size array 'items' [-Wpedantic]
   51 |     const tdb_item items[0];
      |                    ^~~~~
/bin/bash ./libtool  --tag=CC   --mode=compile gcc -DPACKAGE_NAME=\"traildb\" -DPACKAGE_TARNAME=\"traildb\" -DPACKAGE_VERSION=\"0.6\" -DPACKAGE_STRING=\"traildb\ 0.6\" -DPACKAGE_BUGREPORT=\"ville@adroll.com\" -DPACKAGE_URL=\"\" -DPACKAGE=\"traildb\" -DVERSION=\"0.6\" -DHAVE_STDIO_H=1 -DHAVE_STDLIB_H=1 -DHAVE_STRING_H=1 -DHAVE_INTTYPES_H=1 -DHAVE_STDINT_H=1 -DHAVE_STRINGS_H=1 -DHAVE_SYS_STAT_H=1 -DHAVE_SYS_TYPES_H=1 -DHAVE_UNISTD_H=1 -DSTDC_HEADERS=1 -DHAVE_DLFCN_H=1 -DLT_OBJDIR=\".libs/\" -DDSFMT_MEXP=521 -DHAVE_SSE2=1 -DHAVE_LIBJUDY=1 -DHAVE_JUDY_H=1 -DHAVE_ARCHIVE_H=1 -DHAVE_LIBARCHIVE=1 -DSIZEOF_OFF_T=8 -DSIZEOF_SIZE_T=8 -I.  -Isrc/xxhash -Isrc/dsfmt -Wdate-time -D_FORTIFY_SOURCE=2 -std=c99 -DJUDYERROR=judyerror_macro_missing_fix_this -O3 -fvisibility=hidden -g -Wall -Wextra -Wconversion -Wcast-qual -Wformat-security -Wmissing-declarations -Wmissing-prototypes -Wnested-externs -Wpointer-arith -Wshadow -Wstrict-prototypes -g -O2 -ffile-prefix-map=/build/reproducible-path/traildb-0.6+dfsg1=. -fstack-protector-strong -Wformat -Werror=format-security -Wall -pedantic -c -o src/libtraildb_la-tdb_queue.lo `test -f 'src/tdb_queue.c' || echo './'`src/tdb_queue.c
/bin/bash ./libtool  --tag=CC   --mode=compile gcc -DPACKAGE_NAME=\"traildb\" -DPACKAGE_TARNAME=\"traildb\" -DPACKAGE_VERSION=\"0.6\" -DPACKAGE_STRING=\"traildb\ 0.6\" -DPACKAGE_BUGREPORT=\"ville@adroll.com\" -DPACKAGE_URL=\"\" -DPACKAGE=\"traildb\" -DVERSION=\"0.6\" -DHAVE_STDIO_H=1 -DHAVE_STDLIB_H=1 -DHAVE_STRING_H=1 -DHAVE_INTTYPES_H=1 -DHAVE_STDINT_H=1 -DHAVE_STRINGS_H=1 -DHAVE_SYS_STAT_H=1 -DHAVE_SYS_TYPES_H=1 -DHAVE_UNISTD_H=1 -DSTDC_HEADERS=1 -DHAVE_DLFCN_H=1 -DLT_OBJDIR=\".libs/\" -DDSFMT_MEXP=521 -DHAVE_SSE2=1 -DHAVE_LIBJUDY=1 -DHAVE_JUDY_H=1 -DHAVE_ARCHIVE_H=1 -DHAVE_LIBARCHIVE=1 -DSIZEOF_OFF_T=8 -DSIZEOF_SIZE_T=8 -I.  -Isrc/xxhash -Isrc/dsfmt -Wdate-time -D_FORTIFY_SOURCE=2 -std=c99 -DJUDYERROR=judyerror_macro_missing_fix_this -O3 -fvisibility=hidden -g -Wall -Wextra -Wconversion -Wcast-qual -Wformat-security -Wmissing-declarations -Wmissing-prototypes -Wnested-externs -Wpointer-arith -Wshadow -Wstrict-prototypes -g -O2 -ffile-prefix-map=/build/reproducible-path/traildb-0.6+dfsg1=. -fstack-protector-strong -Wformat -Werror=format-security -Wall -pedantic -c -o src/libtraildb_la-tdb_huffman.lo `test -f 'src/tdb_huffman.c' || echo './'`src/tdb_huffman.c
/bin/bash ./libtool  --tag=CC   --mode=compile gcc -DPACKAGE_NAME=\"traildb\" -DPACKAGE_TARNAME=\"traildb\" -DPACKAGE_VERSION=\"0.6\" -DPACKAGE_STRING=\"traildb\ 0.6\" -DPACKAGE_BUGREPORT=\"ville@adroll.com\" -DPACKAGE_URL=\"\" -DPACKAGE=\"traildb\" -DVERSION=\"0.6\" -DHAVE_STDIO_H=1 -DHAVE_STDLIB_H=1 -DHAVE_STRING_H=1 -DHAVE_INTTYPES_H=1 -DHAVE_STDINT_H=1 -DHAVE_STRINGS_H=1 -DHAVE_SYS_STAT_H=1 -DHAVE_SYS_TYPES_H=1 -DHAVE_UNISTD_H=1 -DSTDC_HEADERS=1 -DHAVE_DLFCN_H=1 -DLT_OBJDIR=\".libs/\" -DDSFMT_MEXP=521 -DHAVE_SSE2=1 -DHAVE_LIBJUDY=1 -DHAVE_JUDY_H=1 -DHAVE_ARCHIVE_H=1 -DHAVE_LIBARCHIVE=1 -DSIZEOF_OFF_T=8 -DSIZEOF_SIZE_T=8 -I.  -Isrc/xxhash -Isrc/dsfmt -Wdate-time -D_FORTIFY_SOURCE=2 -std=c99 -DJUDYERROR=judyerror_macro_missing_fix_this -O3 -fvisibility=hidden -g -Wall -Wextra -Wconversion -Wcast-qual -Wformat-security -Wmissing-declarations -Wmissing-prototypes -Wnested-externs -Wpointer-arith -Wshadow -Wstrict-prototypes -g -O2 -ffile-prefix-map=/build/reproducible-path/traildb-0.6+dfsg1=. -fstack-protector-strong -Wformat -Werror=format-security -Wall -pedantic -c -o src/libtraildb_la-tdb_cons_package.lo `test -f 'src/tdb_cons_package.c' || echo './'`src/tdb_cons_package.c
libtool: compile:  gcc -DPACKAGE_NAME=\"traildb\" -DPACKAGE_TARNAME=\"traildb\" -DPACKAGE_VERSION=\"0.6\" "-DPACKAGE_STRING=\"traildb 0.6\"" -DPACKAGE_BUGREPORT=\"ville@adroll.com\" -DPACKAGE_URL=\"\" -DPACKAGE=\"traildb\" -DVERSION=\"0.6\" -DHAVE_STDIO_H=1 -DHAVE_STDLIB_H=1 -DHAVE_STRING_H=1 -DHAVE_INTTYPES_H=1 -DHAVE_STDINT_H=1 -DHAVE_STRINGS_H=1 -DHAVE_SYS_STAT_H=1 -DHAVE_SYS_TYPES_H=1 -DHAVE_UNISTD_H=1 -DSTDC_HEADERS=1 -DHAVE_DLFCN_H=1 -DLT_OBJDIR=\".libs/\" -DDSFMT_MEXP=521 -DHAVE_SSE2=1 -DHAVE_LIBJUDY=1 -DHAVE_JUDY_H=1 -DHAVE_ARCHIVE_H=1 -DHAVE_LIBARCHIVE=1 -DSIZEOF_OFF_T=8 -DSIZEOF_SIZE_T=8 -I. -Isrc/xxhash -Isrc/dsfmt -Wdate-time -D_FORTIFY_SOURCE=2 -O3 -g -fvisibility=hidden -g -O2 -ffile-prefix-map=/build/reproducible-path/traildb-0.6+dfsg1=. -fstack-protector-strong -Wformat -Werror=format-security -Wall -pedantic -c src/xxhash/xxhash.c  -fPIC -DPIC -o src/xxhash/.libs/xxhash.o
libtool: compile:  gcc -DPACKAGE_NAME=\"traildb\" -DPACKAGE_TARNAME=\"traildb\" -DPACKAGE_VERSION=\"0.6\" "-DPACKAGE_STRING=\"traildb 0.6\"" -DPACKAGE_BUGREPORT=\"ville@adroll.com\" -DPACKAGE_URL=\"\" -DPACKAGE=\"traildb\" -DVERSION=\"0.6\" -DHAVE_STDIO_H=1 -DHAVE_STDLIB_H=1 -DHAVE_STRING_H=1 -DHAVE_INTTYPES_H=1 -DHAVE_STDINT_H=1 -DHAVE_STRINGS_H=1 -DHAVE_SYS_STAT_H=1 -DHAVE_SYS_TYPES_H=1 -DHAVE_UNISTD_H=1 -DSTDC_HEADERS=1 -DHAVE_DLFCN_H=1 -DLT_OBJDIR=\".libs/\" -DDSFMT_MEXP=521 -DHAVE_SSE2=1 -DHAVE_LIBJUDY=1 -DHAVE_JUDY_H=1 -DHAVE_ARCHIVE_H=1 -DHAVE_LIBARCHIVE=1 -DSIZEOF_OFF_T=8 -DSIZEOF_SIZE_T=8 -I. -Isrc/xxhash -Isrc/dsfmt -Wdate-time -D_FORTIFY_SOURCE=2 -O3 -g -fvisibility=hidden -g -O2 -ffile-prefix-map=/build/reproducible-path/traildb-0.6+dfsg1=. -fstack-protector-strong -Wformat -Werror=format-security -Wall -pedantic -c src/dsfmt/dSFMT.c  -fPIC -DPIC -o src/dsfmt/.libs/dSFMT.o
In file included from src/dsfmt/dSFMT-params.h:4,
                 from src/dsfmt/dSFMT.c:17:
src/dsfmt/dSFMT.h:148:12: fatal error: emmintrin.h: No such file or directory
  148 | #  include <emmintrin.h>
      |            ^~~~~~~~~~~~~
compilation terminated.
make[1]: *** [Makefile:758: src/dsfmt/dSFMT.lo] Error 1
make[1]: *** Waiting for unfinished jobs....
libtool: compile:  gcc -DPACKAGE_NAME=\"traildb\" -DPACKAGE_TARNAME=\"traildb\" -DPACKAGE_VERSION=\"0.6\" "-DPACKAGE_STRING=\"traildb 0.6\"" -DPACKAGE_BUGREPORT=\"ville@adroll.com\" -DPACKAGE_URL=\"\" -DPACKAGE=\"traildb\" -DVERSION=\"0.6\" -DHAVE_STDIO_H=1 -DHAVE_STDLIB_H=1 -DHAVE_STRING_H=1 -DHAVE_INTTYPES_H=1 -DHAVE_STDINT_H=1 -DHAVE_STRINGS_H=1 -DHAVE_SYS_STAT_H=1 -DHAVE_SYS_TYPES_H=1 -DHAVE_UNISTD_H=1 -DSTDC_HEADERS=1 -DHAVE_DLFCN_H=1 -DLT_OBJDIR=\".libs/\" -DDSFMT_MEXP=521 -DHAVE_SSE2=1 -DHAVE_LIBJUDY=1 -DHAVE_JUDY_H=1 -DHAVE_ARCHIVE_H=1 -DHAVE_LIBARCHIVE=1 -DSIZEOF_OFF_T=8 -DSIZEOF_SIZE_T=8 -I. -Isrc/xxhash -Isrc/dsfmt -Wdate-time -D_FORTIFY_SOURCE=2 -std=c99 -DJUDYERROR=judyerror_macro_missing_fix_this -O3 -fvisibility=hidden -g -Wall -Wextra -Wconversion -Wcast-qual -Wformat-security -Wmissing-declarations -Wmissing-prototypes -Wnested-externs -Wpointer-arith -Wshadow -Wstrict-prototypes -g -O2 -ffile-prefix-map=/build/reproducible-path/traildb-0.6+dfsg1=. -fstack-protector-strong -Wformat -Werror=format-security -Wall -pedantic -c src/tdb_cons.c  -fPIC -DPIC -o src/.libs/libtraildb_la-tdb_cons.o
libtool: compile:  gcc -DPACKAGE_NAME=\"traildb\" -DPACKAGE_TARNAME=\"traildb\" -DPACKAGE_VERSION=\"0.6\" "-DPACKAGE_STRING=\"traildb 0.6\"" -DPACKAGE_BUGREPORT=\"ville@adroll.com\" -DPACKAGE_URL=\"\" -DPACKAGE=\"traildb\" -DVERSION=\"0.6\" -DHAVE_STDIO_H=1 -DHAVE_STDLIB_H=1 -DHAVE_STRING_H=1 -DHAVE_INTTYPES_H=1 -DHAVE_STDINT_H=1 -DHAVE_STRINGS_H=1 -DHAVE_SYS_STAT_H=1 -DHAVE_SYS_TYPES_H=1 -DHAVE_UNISTD_H=1 -DSTDC_HEADERS=1 -DHAVE_DLFCN_H=1 -DLT_OBJDIR=\".libs/\" -DDSFMT_MEXP=521 -DHAVE_SSE2=1 -DHAVE_LIBJUDY=1 -DHAVE_JUDY_H=1 -DHAVE_ARCHIVE_H=1 -DHAVE_LIBARCHIVE=1 -DSIZEOF_OFF_T=8 -DSIZEOF_SIZE_T=8 -I. -Isrc/xxhash -Isrc/dsfmt -Wdate-time -D_FORTIFY_SOURCE=2 -std=c99 -DJUDYERROR=judyerror_macro_missing_fix_this -O3 -fvisibility=hidden -g -Wall -Wextra -Wconversion -Wcast-qual -Wformat-security -Wmissing-declarations -Wmissing-prototypes -Wnested-externs -Wpointer-arith -Wshadow -Wstrict-prototypes -g -O2 -ffile-prefix-map=/build/reproducible-path/traildb-0.6+dfsg1=. -fstack-protector-strong -Wformat -Werror=format-security -Wall -pedantic -c src/tdb_huffman.c  -fPIC -DPIC -o src/.libs/libtraildb_la-tdb_huffman.o
libtool: compile:  gcc -DPACKAGE_NAME=\"traildb\" -DPACKAGE_TARNAME=\"traildb\" -DPACKAGE_VERSION=\"0.6\" "-DPACKAGE_STRING=\"traildb 0.6\"" -DPACKAGE_BUGREPORT=\"ville@adroll.com\" -DPACKAGE_URL=\"\" -DPACKAGE=\"traildb\" -DVERSION=\"0.6\" -DHAVE_STDIO_H=1 -DHAVE_STDLIB_H=1 -DHAVE_STRING_H=1 -DHAVE_INTTYPES_H=1 -DHAVE_STDINT_H=1 -DHAVE_STRINGS_H=1 -DHAVE_SYS_STAT_H=1 -DHAVE_SYS_TYPES_H=1 -DHAVE_UNISTD_H=1 -DSTDC_HEADERS=1 -DHAVE_DLFCN_H=1 -DLT_OBJDIR=\".libs/\" -DDSFMT_MEXP=521 -DHAVE_SSE2=1 -DHAVE_LIBJUDY=1 -DHAVE_JUDY_H=1 -DHAVE_ARCHIVE_H=1 -DHAVE_LIBARCHIVE=1 -DSIZEOF_OFF_T=8 -DSIZEOF_SIZE_T=8 -I. -Isrc/xxhash -Isrc/dsfmt -Wdate-time -D_FORTIFY_SOURCE=2 -std=c99 -DJUDYERROR=judyerror_macro_missing_fix_this -O3 -fvisibility=hidden -g -Wall -Wextra -Wconversion -Wcast-qual -Wformat-security -Wmissing-declarations -Wmissing-prototypes -Wnested-externs -Wpointer-arith -Wshadow -Wstrict-prototypes -g -O2 -ffile-prefix-map=/build/reproducible-path/traildb-0.6+dfsg1=. -fstack-protector-strong -Wformat -Werror=format-security -Wall -pedantic -c src/tdb_decode.c  -fPIC -DPIC -o src/.libs/libtraildb_la-tdb_decode.o
libtool: compile:  gcc -DPACKAGE_NAME=\"traildb\" -DPACKAGE_TARNAME=\"traildb\" -DPACKAGE_VERSION=\"0.6\" "-DPACKAGE_STRING=\"traildb 0.6\"" -DPACKAGE_BUGREPORT=\"ville@adroll.com\" -DPACKAGE_URL=\"\" -DPACKAGE=\"traildb\" -DVERSION=\"0.6\" -DHAVE_STDIO_H=1 -DHAVE_STDLIB_H=1 -DHAVE_STRING_H=1 -DHAVE_INTTYPES_H=1 -DHAVE_STDINT_H=1 -DHAVE_STRINGS_H=1 -DHAVE_SYS_STAT_H=1 -DHAVE_SYS_TYPES_H=1 -DHAVE_UNISTD_H=1 -DSTDC_HEADERS=1 -DHAVE_DLFCN_H=1 -DLT_OBJDIR=\".libs/\" -DDSFMT_MEXP=521 -DHAVE_SSE2=1 -DHAVE_LIBJUDY=1 -DHAVE_JUDY_H=1 -DHAVE_ARCHIVE_H=1 -DHAVE_LIBARCHIVE=1 -DSIZEOF_OFF_T=8 -DSIZEOF_SIZE_T=8 -I. -Isrc/xxhash -Isrc/dsfmt -Wdate-time -D_FORTIFY_SOURCE=2 -std=c99 -DJUDYERROR=judyerror_macro_missing_fix_this -O3 -fvisibility=hidden -g -Wall -Wextra -Wconversion -Wcast-qual -Wformat-security -Wmissing-declarations -Wmissing-prototypes -Wnested-externs -Wpointer-arith -Wshadow -Wstrict-prototypes -g -O2 -ffile-prefix-map=/build/reproducible-path/traildb-0.6+dfsg1=. -fstack-protector-strong -Wformat -Werror=format-security -Wall -pedantic -c src/tdb_encode_model.c  -fPIC -DPIC -o src/.libs/libtraildb_la-tdb_encode_model.o
libtool: compile:  gcc -DPACKAGE_NAME=\"traildb\" -DPACKAGE_TARNAME=\"traildb\" -DPACKAGE_VERSION=\"0.6\" "-DPACKAGE_STRING=\"traildb 0.6\"" -DPACKAGE_BUGREPORT=\"ville@adroll.com\" -DPACKAGE_URL=\"\" -DPACKAGE=\"traildb\" -DVERSION=\"0.6\" -DHAVE_STDIO_H=1 -DHAVE_STDLIB_H=1 -DHAVE_STRING_H=1 -DHAVE_INTTYPES_H=1 -DHAVE_STDINT_H=1 -DHAVE_STRINGS_H=1 -DHAVE_SYS_STAT_H=1 -DHAVE_SYS_TYPES_H=1 -DHAVE_UNISTD_H=1 -DSTDC_HEADERS=1 -DHAVE_DLFCN_H=1 -DLT_OBJDIR=\".libs/\" -DDSFMT_MEXP=521 -DHAVE_SSE2=1 -DHAVE_LIBJUDY=1 -DHAVE_JUDY_H=1 -DHAVE_ARCHIVE_H=1 -DHAVE_LIBARCHIVE=1 -DSIZEOF_OFF_T=8 -DSIZEOF_SIZE_T=8 -I. -Isrc/xxhash -Isrc/dsfmt -Wdate-time -D_FORTIFY_SOURCE=2 -std=c99 -DJUDYERROR=judyerror_macro_missing_fix_this -O3 -fvisibility=hidden -g -Wall -Wextra -Wconversion -Wcast-qual -Wformat-security -Wmissing-declarations -Wmissing-prototypes -Wnested-externs -Wpointer-arith -Wshadow -Wstrict-prototypes -g -O2 -ffile-prefix-map=/build/reproducible-path/traildb-0.6+dfsg1=. -fstack-protector-strong -Wformat -Werror=format-security -Wall -pedantic -c src/tdb.c  -fPIC -DPIC -o src/.libs/libtraildb_la-tdb.o
libtool: compile:  gcc -DPACKAGE_NAME=\"traildb\" -DPACKAGE_TARNAME=\"traildb\" -DPACKAGE_VERSION=\"0.6\" "-DPACKAGE_STRING=\"traildb 0.6\"" -DPACKAGE_BUGREPORT=\"ville@adroll.com\" -DPACKAGE_URL=\"\" -DPACKAGE=\"traildb\" -DVERSION=\"0.6\" -DHAVE_STDIO_H=1 -DHAVE_STDLIB_H=1 -DHAVE_STRING_H=1 -DHAVE_INTTYPES_H=1 -DHAVE_STDINT_H=1 -DHAVE_STRINGS_H=1 -DHAVE_SYS_STAT_H=1 -DHAVE_SYS_TYPES_H=1 -DHAVE_UNISTD_H=1 -DSTDC_HEADERS=1 -DHAVE_DLFCN_H=1 -DLT_OBJDIR=\".libs/\" -DDSFMT_MEXP=521 -DHAVE_SSE2=1 -DHAVE_LIBJUDY=1 -DHAVE_JUDY_H=1 -DHAVE_ARCHIVE_H=1 -DHAVE_LIBARCHIVE=1 -DSIZEOF_OFF_T=8 -DSIZEOF_SIZE_T=8 -I. -Isrc/xxhash -Isrc/dsfmt -Wdate-time -D_FORTIFY_SOURCE=2 -std=c99 -DJUDYERROR=judyerror_macro_missing_fix_this -O3 -fvisibility=hidden -g -Wall -Wextra -Wconversion -Wcast-qual -Wformat-security -Wmissing-declarations -Wmissing-prototypes -Wnested-externs -Wpointer-arith -Wshadow -Wstrict-prototypes -g -O2 -ffile-prefix-map=/build/reproducible-path/traildb-0.6+dfsg1=. -fstack-protector-strong -Wformat -Werror=format-security -Wall -pedantic -c src/tdb_queue.c  -fPIC -DPIC -o src/.libs/libtraildb_la-tdb_queue.o
libtool: compile:  gcc -DPACKAGE_NAME=\"traildb\" -DPACKAGE_TARNAME=\"traildb\" -DPACKAGE_VERSION=\"0.6\" "-DPACKAGE_STRING=\"traildb 0.6\"" -DPACKAGE_BUGREPORT=\"ville@adroll.com\" -DPACKAGE_URL=\"\" -DPACKAGE=\"traildb\" -DVERSION=\"0.6\" -DHAVE_STDIO_H=1 -DHAVE_STDLIB_H=1 -DHAVE_STRING_H=1 -DHAVE_INTTYPES_H=1 -DHAVE_STDINT_H=1 -DHAVE_STRINGS_H=1 -DHAVE_SYS_STAT_H=1 -DHAVE_SYS_TYPES_H=1 -DHAVE_UNISTD_H=1 -DSTDC_HEADERS=1 -DHAVE_DLFCN_H=1 -DLT_OBJDIR=\".libs/\" -DDSFMT_MEXP=521 -DHAVE_SSE2=1 -DHAVE_LIBJUDY=1 -DHAVE_JUDY_H=1 -DHAVE_ARCHIVE_H=1 -DHAVE_LIBARCHIVE=1 -DSIZEOF_OFF_T=8 -DSIZEOF_SIZE_T=8 -I. -Isrc/xxhash -Isrc/dsfmt -Wdate-time -D_FORTIFY_SOURCE=2 -std=c99 -DJUDYERROR=judyerror_macro_missing_fix_this -O3 -fvisibility=hidden -g -Wall -Wextra -Wconversion -Wcast-qual -Wformat-security -Wmissing-declarations -Wmissing-prototypes -Wnested-externs -Wpointer-arith -Wshadow -Wstrict-prototypes -g -O2 -ffile-prefix-map=/build/reproducible-path/traildb-0.6+dfsg1=. -fstack-protector-strong -Wformat -Werror=format-security -Wall -pedantic -c src/tdb_encode.c  -fPIC -DPIC -o src/.libs/libtraildb_la-tdb_encode.o
libtool: compile:  gcc -DPACKAGE_NAME=\"traildb\" -DPACKAGE_TARNAME=\"traildb\" -DPACKAGE_VERSION=\"0.6\" "-DPACKAGE_STRING=\"traildb 0.6\"" -DPACKAGE_BUGREPORT=\"ville@adroll.com\" -DPACKAGE_URL=\"\" -DPACKAGE=\"traildb\" -DVERSION=\"0.6\" -DHAVE_STDIO_H=1 -DHAVE_STDLIB_H=1 -DHAVE_STRING_H=1 -DHAVE_INTTYPES_H=1 -DHAVE_STDINT_H=1 -DHAVE_STRINGS_H=1 -DHAVE_SYS_STAT_H=1 -DHAVE_SYS_TYPES_H=1 -DHAVE_UNISTD_H=1 -DSTDC_HEADERS=1 -DHAVE_DLFCN_H=1 -DLT_OBJDIR=\".libs/\" -DDSFMT_MEXP=521 -DHAVE_SSE2=1 -DHAVE_LIBJUDY=1 -DHAVE_JUDY_H=1 -DHAVE_ARCHIVE_H=1 -DHAVE_LIBARCHIVE=1 -DSIZEOF_OFF_T=8 -DSIZEOF_SIZE_T=8 -I. -Isrc/xxhash -Isrc/dsfmt -Wdate-time -D_FORTIFY_SOURCE=2 -std=c99 -DJUDYERROR=judyerror_macro_missing_fix_this -O3 -fvisibility=hidden -g -Wall -Wextra -Wconversion -Wcast-qual -Wformat-security -Wmissing-declarations -Wmissing-prototypes -Wnested-externs -Wpointer-arith -Wshadow -Wstrict-prototypes -g -O2 -ffile-prefix-map=/build/reproducible-path/traildb-0.6+dfsg1=. -fstack-protector-strong -Wformat -Werror=format-security -Wall -pedantic -c src/tdb_uuid.c  -fPIC -DPIC -o src/.libs/libtraildb_la-tdb_uuid.o
In file included from src/traildb.h:9,
                 from src/tdb_internal.h:9,
                 from src/tdb_cons.c:21:
src/tdb_types.h:51:20: warning: ISO C forbids zero-size array 'items' [-Wpedantic]
   51 |     const tdb_item items[0];
      |                    ^~~~~
In file included from src/traildb.h:9,
                 from src/tdb_internal.h:9,
                 from src/tdb_encode_model.c:15:
src/tdb_types.h:51:20: warning: ISO C forbids zero-size array 'items' [-Wpedantic]
   51 |     const tdb_item items[0];
      |                    ^~~~~
In file included from src/traildb.h:9,
                 from src/tdb_internal.h:9,
                 from src/tdb_decode.c:1:
src/tdb_types.h:51:20: warning: ISO C forbids zero-size array 'items' [-Wpedantic]
   51 |     const tdb_item items[0];
      |                    ^~~~~
src/tdb_internal.h:86:14: warning: ISO C forbids zero-size array 'previous_items' [-Wpedantic]
   86 |     tdb_item previous_items[0];
      |              ^~~~~~~~~~~~~~
src/tdb_cons.c: In function 'store_lexicons':
src/tdb_cons.c:125:26: warning: ISO C99 requires at least one argument for the "..." in a variadic macro
  125 |     TDB_FPRINTF(out, "\n");
      |                          ^
In file included from src/tdb_huffman.h:8,
                 from src/tdb_huffman.c:13:
src/tdb_types.h:51:20: warning: ISO C forbids zero-size array 'items' [-Wpedantic]
   51 |     const tdb_item items[0];
      |                    ^~~~~
src/tdb_internal.h:86:14: warning: ISO C forbids zero-size array 'previous_items' [-Wpedantic]
   86 |     tdb_item previous_items[0];
      |              ^~~~~~~~~~~~~~
In file included from src/tdb_encode_model.c:17:
src/tdb_huffman.h:27:14: warning: ISO C forbids zero-size array 'field_bits' [-Wpedantic]
   27 |     uint32_t field_bits[0];
      |              ^~~~~~~~~~
In file included from src/tdb_huffman.h:10:
src/tdb_internal.h:86:14: warning: ISO C forbids zero-size array 'previous_items' [-Wpedantic]
   86 |     tdb_item previous_items[0];
      |              ^~~~~~~~~~~~~~
In file included from src/tdb_encode_model.c:22:
src/dsfmt/dSFMT.h:148:12: fatal error: emmintrin.h: No such file or directory
  148 | #  include <emmintrin.h>
      |            ^~~~~~~~~~~~~
compilation terminated.
src/tdb_internal.h:86:14: warning: ISO C forbids zero-size array 'previous_items' [-Wpedantic]
   86 |     tdb_item previous_items[0];
      |              ^~~~~~~~~~~~~~
In file included from src/tdb_decode.c:2:
src/tdb_huffman.h:27:14: warning: ISO C forbids zero-size array 'field_bits' [-Wpedantic]
   27 |     uint32_t field_bits[0];
      |              ^~~~~~~~~~
src/tdb_huffman.h:27:14: warning: ISO C forbids zero-size array 'field_bits' [-Wpedantic]
   27 |     uint32_t field_bits[0];
      |              ^~~~~~~~~~
make[1]: *** [Makefile:800: src/libtraildb_la-tdb_encode_model.lo] Error 1
In file included from src/traildb.h:9,
                 from src/tdb_uuid.c:2:
src/tdb_types.h:51:20: warning: ISO C forbids zero-size array 'items' [-Wpedantic]
   51 |     const tdb_item items[0];
      |                    ^~~~~
In file included from src/traildb.h:9,
                 from src/tdb_internal.h:9,
                 from src/tdb_encode.c:18:
src/tdb_types.h:51:20: warning: ISO C forbids zero-size array 'items' [-Wpedantic]
   51 |     const tdb_item items[0];
      |                    ^~~~~
src/tdb_internal.h:86:14: warning: ISO C forbids zero-size array 'previous_items' [-Wpedantic]
   86 |     tdb_item previous_items[0];
      |              ^~~~~~~~~~~~~~
In file included from src/traildb.h:9,
                 from src/tdb_internal.h:9,
                 from src/tdb.c:22:
src/tdb_types.h:51:20: warning: ISO C forbids zero-size array 'items' [-Wpedantic]
   51 |     const tdb_item items[0];
      |                    ^~~~~
In file included from src/tdb_encode.c:20:
src/tdb_huffman.h:27:14: warning: ISO C forbids zero-size array 'field_bits' [-Wpedantic]
   27 |     uint32_t field_bits[0];
      |              ^~~~~~~~~~
src/tdb_internal.h:86:14: warning: ISO C forbids zero-size array 'previous_items' [-Wpedantic]
   86 |     tdb_item previous_items[0];
      |              ^~~~~~~~~~~~~~
In file included from src/tdb.c:25:
src/tdb_huffman.h:27:14: warning: ISO C forbids zero-size array 'field_bits' [-Wpedantic]
   27 |     uint32_t field_bits[0];
      |              ^~~~~~~~~~
src/tdb.c:553:54: warning: argument 2 of type 'const uint8_t *' {aka 'const unsigned char *'} declared as a pointer [-Warray-parameter=]
  553 |                                       const uint8_t *uuid,
      |                                       ~~~~~~~~~~~~~~~^~~~
src/traildb.h:162:42: note: previously declared as an array 'const uint8_t[16]' {aka 'const unsigned char[16]'}
  162 |                            const uint8_t uuid[16],
      |                            ~~~~~~~~~~~~~~^~~~~~~~
libtool: compile:  gcc -DPACKAGE_NAME=\"traildb\" -DPACKAGE_TARNAME=\"traildb\" -DPACKAGE_VERSION=\"0.6\" "-DPACKAGE_STRING=\"traildb 0.6\"" -DPACKAGE_BUGREPORT=\"ville@adroll.com\" -DPACKAGE_URL=\"\" -DPACKAGE=\"traildb\" -DVERSION=\"0.6\" -DHAVE_STDIO_H=1 -DHAVE_STDLIB_H=1 -DHAVE_STRING_H=1 -DHAVE_INTTYPES_H=1 -DHAVE_STDINT_H=1 -DHAVE_STRINGS_H=1 -DHAVE_SYS_STAT_H=1 -DHAVE_SYS_TYPES_H=1 -DHAVE_UNISTD_H=1 -DSTDC_HEADERS=1 -DHAVE_DLFCN_H=1 -DLT_OBJDIR=\".libs/\" -DDSFMT_MEXP=521 -DHAVE_SSE2=1 -DHAVE_LIBJUDY=1 -DHAVE_JUDY_H=1 -DHAVE_ARCHIVE_H=1 -DHAVE_LIBARCHIVE=1 -DSIZEOF_OFF_T=8 -DSIZEOF_SIZE_T=8 -I. -Isrc/xxhash -Isrc/dsfmt -Wdate-time -D_FORTIFY_SOURCE=2 -std=c99 -DJUDYERROR=judyerror_macro_missing_fix_this -O3 -fvisibility=hidden -g -Wall -Wextra -Wconversion -Wcast-qual -Wformat-security -Wmissing-declarations -Wmissing-prototypes -Wnested-externs -Wpointer-arith -Wshadow -Wstrict-prototypes -g -O2 -ffile-prefix-map=/build/reproducible-path/traildb-0.6+dfsg1=. -fstack-protector-strong -Wformat -Werror=format-security -Wall -pedantic -c src/tdb_cons_package.c  -fPIC -DPIC -o src/.libs/libtraildb_la-tdb_cons_package.o
libtool: compile:  gcc -DPACKAGE_NAME=\"traildb\" -DPACKAGE_TARNAME=\"traildb\" -DPACKAGE_VERSION=\"0.6\" "-DPACKAGE_STRING=\"traildb 0.6\"" -DPACKAGE_BUGREPORT=\"ville@adroll.com\" -DPACKAGE_URL=\"\" -DPACKAGE=\"traildb\" -DVERSION=\"0.6\" -DHAVE_STDIO_H=1 -DHAVE_STDLIB_H=1 -DHAVE_STRING_H=1 -DHAVE_INTTYPES_H=1 -DHAVE_STDINT_H=1 -DHAVE_STRINGS_H=1 -DHAVE_SYS_STAT_H=1 -DHAVE_SYS_TYPES_H=1 -DHAVE_UNISTD_H=1 -DSTDC_HEADERS=1 -DHAVE_DLFCN_H=1 -DLT_OBJDIR=\".libs/\" -DDSFMT_MEXP=521 -DHAVE_SSE2=1 -DHAVE_LIBJUDY=1 -DHAVE_JUDY_H=1 -DHAVE_ARCHIVE_H=1 -DHAVE_LIBARCHIVE=1 -DSIZEOF_OFF_T=8 -DSIZEOF_SIZE_T=8 -I. -Isrc/xxhash -Isrc/dsfmt -Wdate-time -D_FORTIFY_SOURCE=2 -std=c99 -DJUDYERROR=judyerror_macro_missing_fix_this -O3 -fvisibility=hidden -g -Wall -Wextra -Wconversion -Wcast-qual -Wformat-security -Wmissing-declarations -Wmissing-prototypes -Wnested-externs -Wpointer-arith -Wshadow -Wstrict-prototypes -g -O2 -ffile-prefix-map=/build/reproducible-path/traildb-0.6+dfsg1=. -fstack-protector-strong -Wformat -Werror=format-security -Wall -pedantic -c src/tdb_queue.c -o src/libtraildb_la-tdb_queue.o >/dev/null 2>&1
libtool: compile:  gcc -DPACKAGE_NAME=\"traildb\" -DPACKAGE_TARNAME=\"traildb\" -DPACKAGE_VERSION=\"0.6\" "-DPACKAGE_STRING=\"traildb 0.6\"" -DPACKAGE_BUGREPORT=\"ville@adroll.com\" -DPACKAGE_URL=\"\" -DPACKAGE=\"traildb\" -DVERSION=\"0.6\" -DHAVE_STDIO_H=1 -DHAVE_STDLIB_H=1 -DHAVE_STRING_H=1 -DHAVE_INTTYPES_H=1 -DHAVE_STDINT_H=1 -DHAVE_STRINGS_H=1 -DHAVE_SYS_STAT_H=1 -DHAVE_SYS_TYPES_H=1 -DHAVE_UNISTD_H=1 -DSTDC_HEADERS=1 -DHAVE_DLFCN_H=1 -DLT_OBJDIR=\".libs/\" -DDSFMT_MEXP=521 -DHAVE_SSE2=1 -DHAVE_LIBJUDY=1 -DHAVE_JUDY_H=1 -DHAVE_ARCHIVE_H=1 -DHAVE_LIBARCHIVE=1 -DSIZEOF_OFF_T=8 -DSIZEOF_SIZE_T=8 -I. -Isrc/xxhash -Isrc/dsfmt -Wdate-time -D_FORTIFY_SOURCE=2 -std=c99 -DJUDYERROR=judyerror_macro_missing_fix_this -O3 -fvisibility=hidden -g -Wall -Wextra -Wconversion -Wcast-qual -Wformat-security -Wmissing-declarations -Wmissing-prototypes -Wnested-externs -Wpointer-arith -Wshadow -Wstrict-prototypes -g -O2 -ffile-prefix-map=/build/reproducible-path/traildb-0.6+dfsg1=. -fstack-protector-strong -Wformat -Werror=format-security -Wall -pedantic -c src/tdb_uuid.c -o src/libtraildb_la-tdb_uuid.o >/dev/null 2>&1
In file included from src/traildb.h:9,
                 from src/tdb_internal.h:9,
                 from src/tdb_package.h:7,
                 from src/tdb_cons_package.c:18:
src/tdb_types.h:51:20: warning: ISO C forbids zero-size array 'items' [-Wpedantic]
   51 |     const tdb_item items[0];
      |                    ^~~~~
src/tdb_internal.h:86:14: warning: ISO C forbids zero-size array 'previous_items' [-Wpedantic]
   86 |     tdb_item previous_items[0];
      |              ^~~~~~~~~~~~~~
src/tdb_cons_package.c: In function 'write_tar_toc':
src/tdb_cons_package.c:269:31: warning: ISO C99 requires at least one argument for the "..." in a variadic macro
  269 |     TDB_FPRINTF(toc_file, "\n");
      |                               ^
src/tdb_cons_package.c: In function 'cons_package':
src/tdb_cons_package.c:358:40: warning: ISO C99 requires at least one argument for the "..." in a variadic macro
  358 |     TDB_FPRINTF(toc_file, TDB_TAR_MAGIC);
      |                                        ^
libtool: compile:  gcc -DPACKAGE_NAME=\"traildb\" -DPACKAGE_TARNAME=\"traildb\" -DPACKAGE_VERSION=\"0.6\" "-DPACKAGE_STRING=\"traildb 0.6\"" -DPACKAGE_BUGREPORT=\"ville@adroll.com\" -DPACKAGE_URL=\"\" -DPACKAGE=\"traildb\" -DVERSION=\"0.6\" -DHAVE_STDIO_H=1 -DHAVE_STDLIB_H=1 -DHAVE_STRING_H=1 -DHAVE_INTTYPES_H=1 -DHAVE_STDINT_H=1 -DHAVE_STRINGS_H=1 -DHAVE_SYS_STAT_H=1 -DHAVE_SYS_TYPES_H=1 -DHAVE_UNISTD_H=1 -DSTDC_HEADERS=1 -DHAVE_DLFCN_H=1 -DLT_OBJDIR=\".libs/\" -DDSFMT_MEXP=521 -DHAVE_SSE2=1 -DHAVE_LIBJUDY=1 -DHAVE_JUDY_H=1 -DHAVE_ARCHIVE_H=1 -DHAVE_LIBARCHIVE=1 -DSIZEOF_OFF_T=8 -DSIZEOF_SIZE_T=8 -I. -Isrc/xxhash -Isrc/dsfmt -Wdate-time -D_FORTIFY_SOURCE=2 -std=c99 -DJUDYERROR=judyerror_macro_missing_fix_this -O3 -fvisibility=hidden -g -Wall -Wextra -Wconversion -Wcast-qual -Wformat-security -Wmissing-declarations -Wmissing-prototypes -Wnested-externs -Wpointer-arith -Wshadow -Wstrict-prototypes -g -O2 -ffile-prefix-map=/build/reproducible-path/traildb-0.6+dfsg1=. -fstack-protector-strong -Wformat -Werror=format-security -Wall -pedantic -c src/tdb_huffman.c -o src/libtraildb_la-tdb_huffman.o >/dev/null 2>&1
libtool: compile:  gcc -DPACKAGE_NAME=\"traildb\" -DPACKAGE_TARNAME=\"traildb\" -DPACKAGE_VERSION=\"0.6\" "-DPACKAGE_STRING=\"traildb 0.6\"" -DPACKAGE_BUGREPORT=\"ville@adroll.com\" -DPACKAGE_URL=\"\" -DPACKAGE=\"traildb\" -DVERSION=\"0.6\" -DHAVE_STDIO_H=1 -DHAVE_STDLIB_H=1 -DHAVE_STRING_H=1 -DHAVE_INTTYPES_H=1 -DHAVE_STDINT_H=1 -DHAVE_STRINGS_H=1 -DHAVE_SYS_STAT_H=1 -DHAVE_SYS_TYPES_H=1 -DHAVE_UNISTD_H=1 -DSTDC_HEADERS=1 -DHAVE_DLFCN_H=1 -DLT_OBJDIR=\".libs/\" -DDSFMT_MEXP=521 -DHAVE_SSE2=1 -DHAVE_LIBJUDY=1 -DHAVE_JUDY_H=1 -DHAVE_ARCHIVE_H=1 -DHAVE_LIBARCHIVE=1 -DSIZEOF_OFF_T=8 -DSIZEOF_SIZE_T=8 -I. -Isrc/xxhash -Isrc/dsfmt -Wdate-time -D_FORTIFY_SOURCE=2 -std=c99 -DJUDYERROR=judyerror_macro_missing_fix_this -O3 -fvisibility=hidden -g -Wall -Wextra -Wconversion -Wcast-qual -Wformat-security -Wmissing-declarations -Wmissing-prototypes -Wnested-externs -Wpointer-arith -Wshadow -Wstrict-prototypes -g -O2 -ffile-prefix-map=/build/reproducible-path/traildb-0.6+dfsg1=. -fstack-protector-strong -Wformat -Werror=format-security -Wall -pedantic -c src/tdb_decode.c -o src/libtraildb_la-tdb_decode.o >/dev/null 2>&1
libtool: compile:  gcc -DPACKAGE_NAME=\"traildb\" -DPACKAGE_TARNAME=\"traildb\" -DPACKAGE_VERSION=\"0.6\" "-DPACKAGE_STRING=\"traildb 0.6\"" -DPACKAGE_BUGREPORT=\"ville@adroll.com\" -DPACKAGE_URL=\"\" -DPACKAGE=\"traildb\" -DVERSION=\"0.6\" -DHAVE_STDIO_H=1 -DHAVE_STDLIB_H=1 -DHAVE_STRING_H=1 -DHAVE_INTTYPES_H=1 -DHAVE_STDINT_H=1 -DHAVE_STRINGS_H=1 -DHAVE_SYS_STAT_H=1 -DHAVE_SYS_TYPES_H=1 -DHAVE_UNISTD_H=1 -DSTDC_HEADERS=1 -DHAVE_DLFCN_H=1 -DLT_OBJDIR=\".libs/\" -DDSFMT_MEXP=521 -DHAVE_SSE2=1 -DHAVE_LIBJUDY=1 -DHAVE_JUDY_H=1 -DHAVE_ARCHIVE_H=1 -DHAVE_LIBARCHIVE=1 -DSIZEOF_OFF_T=8 -DSIZEOF_SIZE_T=8 -I. -Isrc/xxhash -Isrc/dsfmt -Wdate-time -D_FORTIFY_SOURCE=2 -std=c99 -DJUDYERROR=judyerror_macro_missing_fix_this -O3 -fvisibility=hidden -g -Wall -Wextra -Wconversion -Wcast-qual -Wformat-security -Wmissing-declarations -Wmissing-prototypes -Wnested-externs -Wpointer-arith -Wshadow -Wstrict-prototypes -g -O2 -ffile-prefix-map=/build/reproducible-path/traildb-0.6+dfsg1=. -fstack-protector-strong -Wformat -Werror=format-security -Wall -pedantic -c src/tdb_encode.c -o src/libtraildb_la-tdb_encode.o >/dev/null 2>&1
libtool: compile:  gcc -DPACKAGE_NAME=\"traildb\" -DPACKAGE_TARNAME=\"traildb\" -DPACKAGE_VERSION=\"0.6\" "-DPACKAGE_STRING=\"traildb 0.6\"" -DPACKAGE_BUGREPORT=\"ville@adroll.com\" -DPACKAGE_URL=\"\" -DPACKAGE=\"traildb\" -DVERSION=\"0.6\" -DHAVE_STDIO_H=1 -DHAVE_STDLIB_H=1 -DHAVE_STRING_H=1 -DHAVE_INTTYPES_H=1 -DHAVE_STDINT_H=1 -DHAVE_STRINGS_H=1 -DHAVE_SYS_STAT_H=1 -DHAVE_SYS_TYPES_H=1 -DHAVE_UNISTD_H=1 -DSTDC_HEADERS=1 -DHAVE_DLFCN_H=1 -DLT_OBJDIR=\".libs/\" -DDSFMT_MEXP=521 -DHAVE_SSE2=1 -DHAVE_LIBJUDY=1 -DHAVE_JUDY_H=1 -DHAVE_ARCHIVE_H=1 -DHAVE_LIBARCHIVE=1 -DSIZEOF_OFF_T=8 -DSIZEOF_SIZE_T=8 -I. -Isrc/xxhash -Isrc/dsfmt -Wdate-time -D_FORTIFY_SOURCE=2 -std=c99 -DJUDYERROR=judyerror_macro_missing_fix_this -O3 -fvisibility=hidden -g -Wall -Wextra -Wconversion -Wcast-qual -Wformat-security -Wmissing-declarations -Wmissing-prototypes -Wnested-externs -Wpointer-arith -Wshadow -Wstrict-prototypes -g -O2 -ffile-prefix-map=/build/reproducible-path/traildb-0.6+dfsg1=. -fstack-protector-strong -Wformat -Werror=format-security -Wall -pedantic -c src/tdb_cons_package.c -o src/libtraildb_la-tdb_cons_package.o >/dev/null 2>&1
libtool: compile:  gcc -DPACKAGE_NAME=\"traildb\" -DPACKAGE_TARNAME=\"traildb\" -DPACKAGE_VERSION=\"0.6\" "-DPACKAGE_STRING=\"traildb 0.6\"" -DPACKAGE_BUGREPORT=\"ville@adroll.com\" -DPACKAGE_URL=\"\" -DPACKAGE=\"traildb\" -DVERSION=\"0.6\" -DHAVE_STDIO_H=1 -DHAVE_STDLIB_H=1 -DHAVE_STRING_H=1 -DHAVE_INTTYPES_H=1 -DHAVE_STDINT_H=1 -DHAVE_STRINGS_H=1 -DHAVE_SYS_STAT_H=1 -DHAVE_SYS_TYPES_H=1 -DHAVE_UNISTD_H=1 -DSTDC_HEADERS=1 -DHAVE_DLFCN_H=1 -DLT_OBJDIR=\".libs/\" -DDSFMT_MEXP=521 -DHAVE_SSE2=1 -DHAVE_LIBJUDY=1 -DHAVE_JUDY_H=1 -DHAVE_ARCHIVE_H=1 -DHAVE_LIBARCHIVE=1 -DSIZEOF_OFF_T=8 -DSIZEOF_SIZE_T=8 -I. -Isrc/xxhash -Isrc/dsfmt -Wdate-time -D_FORTIFY_SOURCE=2 -O3 -g -fvisibility=hidden -g -O2 -ffile-prefix-map=/build/reproducible-path/traildb-0.6+dfsg1=. -fstack-protector-strong -Wformat -Werror=format-security -Wall -pedantic -c src/xxhash/xxhash.c -o src/xxhash/xxhash.o >/dev/null 2>&1
libtool: compile:  gcc -DPACKAGE_NAME=\"traildb\" -DPACKAGE_TARNAME=\"traildb\" -DPACKAGE_VERSION=\"0.6\" "-DPACKAGE_STRING=\"traildb 0.6\"" -DPACKAGE_BUGREPORT=\"ville@adroll.com\" -DPACKAGE_URL=\"\" -DPACKAGE=\"traildb\" -DVERSION=\"0.6\" -DHAVE_STDIO_H=1 -DHAVE_STDLIB_H=1 -DHAVE_STRING_H=1 -DHAVE_INTTYPES_H=1 -DHAVE_STDINT_H=1 -DHAVE_STRINGS_H=1 -DHAVE_SYS_STAT_H=1 -DHAVE_SYS_TYPES_H=1 -DHAVE_UNISTD_H=1 -DSTDC_HEADERS=1 -DHAVE_DLFCN_H=1 -DLT_OBJDIR=\".libs/\" -DDSFMT_MEXP=521 -DHAVE_SSE2=1 -DHAVE_LIBJUDY=1 -DHAVE_JUDY_H=1 -DHAVE_ARCHIVE_H=1 -DHAVE_LIBARCHIVE=1 -DSIZEOF_OFF_T=8 -DSIZEOF_SIZE_T=8 -I. -Isrc/xxhash -Isrc/dsfmt -Wdate-time -D_FORTIFY_SOURCE=2 -std=c99 -DJUDYERROR=judyerror_macro_missing_fix_this -O3 -fvisibility=hidden -g -Wall -Wextra -Wconversion -Wcast-qual -Wformat-security -Wmissing-declarations -Wmissing-prototypes -Wnested-externs -Wpointer-arith -Wshadow -Wstrict-prototypes -g -O2 -ffile-prefix-map=/build/reproducible-path/traildb-0.6+dfsg1=. -fstack-protector-strong -Wformat -Werror=format-security -Wall -pedantic -c src/tdb_cons.c -o src/libtraildb_la-tdb_cons.o >/dev/null 2>&1
libtool: compile:  gcc -DPACKAGE_NAME=\"traildb\" -DPACKAGE_TARNAME=\"traildb\" -DPACKAGE_VERSION=\"0.6\" "-DPACKAGE_STRING=\"traildb 0.6\"" -DPACKAGE_BUGREPORT=\"ville@adroll.com\" -DPACKAGE_URL=\"\" -DPACKAGE=\"traildb\" -DVERSION=\"0.6\" -DHAVE_STDIO_H=1 -DHAVE_STDLIB_H=1 -DHAVE_STRING_H=1 -DHAVE_INTTYPES_H=1 -DHAVE_STDINT_H=1 -DHAVE_STRINGS_H=1 -DHAVE_SYS_STAT_H=1 -DHAVE_SYS_TYPES_H=1 -DHAVE_UNISTD_H=1 -DSTDC_HEADERS=1 -DHAVE_DLFCN_H=1 -DLT_OBJDIR=\".libs/\" -DDSFMT_MEXP=521 -DHAVE_SSE2=1 -DHAVE_LIBJUDY=1 -DHAVE_JUDY_H=1 -DHAVE_ARCHIVE_H=1 -DHAVE_LIBARCHIVE=1 -DSIZEOF_OFF_T=8 -DSIZEOF_SIZE_T=8 -I. -Isrc/xxhash -Isrc/dsfmt -Wdate-time -D_FORTIFY_SOURCE=2 -std=c99 -DJUDYERROR=judyerror_macro_missing_fix_this -O3 -fvisibility=hidden -g -Wall -Wextra -Wconversion -Wcast-qual -Wformat-security -Wmissing-declarations -Wmissing-prototypes -Wnested-externs -Wpointer-arith -Wshadow -Wstrict-prototypes -g -O2 -ffile-prefix-map=/build/reproducible-path/traildb-0.6+dfsg1=. -fstack-protector-strong -Wformat -Werror=format-security -Wall -pedantic -c src/tdb.c -o src/libtraildb_la-tdb.o >/dev/null 2>&1
make[1]: Leaving directory '/build/reproducible-path/traildb-0.6+dfsg1'
dh_auto_build: error: make -j12 returned exit code 2
make: *** [debian/rules:10: build] Error 25
dpkg-buildpackage: error: debian/rules build subprocess returned exit status 2
I: copying local configuration
E: Failed autobuilding of package
I: unmounting dev/ptmx filesystem
I: unmounting dev/pts filesystem
I: unmounting dev/shm filesystem
I: unmounting proc filesystem
I: unmounting sys filesystem
I: cleaning the build env 
I: removing directory /srv/workspace/pbuilder/2006718 and its subdirectories
Sun Jan  7 18:11:30 UTC 2024  W: No second build log, what happened?