Mon Feb  3 22:21:07 UTC 2025  I: starting to build asmjit/experimental/armhf on jenkins on '2025-02-03 22:21'
Mon Feb  3 22:21:07 UTC 2025  I: The jenkins build log is/was available at https://jenkins.debian.net/userContent/reproducible/debian/build_service/armhf_4/12995/console.log
Mon Feb  3 22:21:07 UTC 2025  I: Downloading source for experimental/asmjit=0.0~git20231115.1da9e4d-2~exp2
--2025-02-03 22:21:07--  http://cdn-fastly.deb.debian.org/debian/pool/main/a/asmjit/asmjit_0.0%7egit20231115.1da9e4d-2%7eexp2.dsc
Connecting to 46.16.76.132:3128... connected.
Proxy request sent, awaiting response... 200 OK
Length: 2251 (2.2K) [text/prs.lines.tag]
Saving to: ‘asmjit_0.0~git20231115.1da9e4d-2~exp2.dsc’

     0K ..                                                    100%  409M=0s

2025-02-03 22:21:07 (409 MB/s) - ‘asmjit_0.0~git20231115.1da9e4d-2~exp2.dsc’ saved [2251/2251]

Mon Feb  3 22:21:07 UTC 2025  I: asmjit_0.0~git20231115.1da9e4d-2~exp2.dsc
-----BEGIN PGP SIGNED MESSAGE-----
Hash: SHA512

Format: 3.0 (quilt)
Source: asmjit
Binary: libasmjit-dev
Architecture: any
Version: 0.0~git20231115.1da9e4d-2~exp2
Maintainer: Debian Deep Learning Team <debian-science-maintainers@lists.alioth.debian.org>
Uploaders:  Yangfl <mmyangfl@gmail.com>, Mo Zhou <lumin@debian.org>, Andrius Merkys <merkys@debian.org>,
Homepage: https://github.com/asmjit/asmjit
Standards-Version: 4.6.2
Vcs-Browser: https://salsa.debian.org/deeplearning-team/asmjit
Vcs-Git: https://salsa.debian.org/deeplearning-team/asmjit.git
Testsuite: autopkgtest
Testsuite-Triggers: @builddeps@
Build-Depends: architecture-is-little-endian, cmake, debhelper-compat (= 13)
Package-List:
 libasmjit-dev deb libdevel optional arch=any
Checksums-Sha1:
 62c0bd4cd74de25d4eed0fde3fe3b257fb6d68de 768968 asmjit_0.0~git20231115.1da9e4d.orig.tar.xz
 20b8478f9592a74c4c4be43595a94f27e659c080 3356 asmjit_0.0~git20231115.1da9e4d-2~exp2.debian.tar.xz
Checksums-Sha256:
 361308fc510137aa87d4dd6587ec84949b01ad654b77feea8ef145046587d493 768968 asmjit_0.0~git20231115.1da9e4d.orig.tar.xz
 1b60b4c994ea009987c5cd7c10c498b8b1e448535bfb406a4ffb70808604a141 3356 asmjit_0.0~git20231115.1da9e4d-2~exp2.debian.tar.xz
Files:
 9e8d65fabd2a41c292bc1ab14f16f73a 768968 asmjit_0.0~git20231115.1da9e4d.orig.tar.xz
 d741108304584017964baab5c7779c56 3356 asmjit_0.0~git20231115.1da9e4d-2~exp2.debian.tar.xz

-----BEGIN PGP SIGNATURE-----

iQJGBAEBCgAwFiEEdyKS9veshfrgQdQe5fQ/nCc08ocFAmYoo/wSHG1lcmt5c0Bk
ZWJpYW4ub3JnAAoJEOX0P5wnNPKH3OcQAI/lgUjAhSaheVDSpwMiI8mhkwjSk6uY
aMV5Pm9sjPhsY1XfGndDKg7OLywXpdsuK4LWqbtJgpHZEN5Ca+BMimww8KBoqK5p
Isefiwlyx1YkP/aGQrVDQMhQMwlQg03+vhXkkBYg1pd5mWriMCKxfiODXwFPjgVs
pNVD+5/beI6y2Z2nxElOrBwY1jjH+54trFtRdJJEzbxIt+XFXI8ftgOgNhZsrozL
2TauC4M25AlMsvLyWyOCdpMZXq2xdaQnbeyNDLbf5FYyQXOQSCzKsvrI88dSbZFX
/0MGUWuPmpTROb2Fue6FKkZIVMe3ASOxCTG0Ktj0Om/F0hQvwQFXui0eb+9jsgsj
NLT5l4zGuYq7Yx6SyJvUkkb6NjA4LoXrupQuHRYZgwczOed7T2eBN2eZT+2B6/IF
kBMTguhIYjdWvDNHGMsmn5cCNFTjlyD6oBdg9mzWYInrr2I7Szr26tfYWQgkaGFL
/6OLDNRa/3AEwCguhFyuIvMJTetI/bCvE1RkIezOYp0Nds8yfgzVXp0J1GfLVePB
k/sgEmL0Ft1Korp6vTx+PQjejj79jifLpV+tIiM53T5WqCnh/H3KpJner45i/sI5
3neVrMLMTsu9HGkaC97GtqKJxPl+W8FZ2DFPRI+hV8qoqbhM8M2Z675Y5n1k/Ukt
p9hX/dsCcBki
=hfRK
-----END PGP SIGNATURE-----
Mon Feb  3 22:21:07 UTC 2025  I: Checking whether the package is not for us
Mon Feb  3 22:21:07 UTC 2025  I: Starting 1st build on remote node virt64z-armhf-rb.debian.net.
Mon Feb  3 22:21:07 UTC 2025  I: Preparing to do remote build '1' on virt64z-armhf-rb.debian.net.
Mon Feb  3 22:22:20 UTC 2025  I: Deleting $TMPDIR on virt64z-armhf-rb.debian.net.
I: pbuilder: network access will be disabled during build
I: Current time: Mon Feb  3 10:21:13 -12 2025
I: pbuilder-time-stamp: 1738621273
I: Building the build Environment
I: extracting base tarball [/var/cache/pbuilder/experimental-reproducible-base.tgz]
I: copying local configuration
W: --override-config is not set; not updating apt.conf Read the manpage for details.
I: mounting /proc filesystem
I: mounting /sys filesystem
I: creating /{dev,run}/shm
I: mounting /dev/pts filesystem
I: redirecting /dev/ptmx to /dev/pts/ptmx
I: policy-rc.d already exists
I: Copying source file
I: copying [asmjit_0.0~git20231115.1da9e4d-2~exp2.dsc]
I: copying [./asmjit_0.0~git20231115.1da9e4d.orig.tar.xz]
I: copying [./asmjit_0.0~git20231115.1da9e4d-2~exp2.debian.tar.xz]
I: Extracting source
dpkg-source: warning: cannot verify inline signature for ./asmjit_0.0~git20231115.1da9e4d-2~exp2.dsc: unsupported subcommand
dpkg-source: info: extracting asmjit in asmjit-0.0~git20231115.1da9e4d
dpkg-source: info: unpacking asmjit_0.0~git20231115.1da9e4d.orig.tar.xz
dpkg-source: info: unpacking asmjit_0.0~git20231115.1da9e4d-2~exp2.debian.tar.xz
I: Not using root during the build.
I: Installing the build-deps
I: user script /srv/workspace/pbuilder/8498/tmp/hooks/D02_print_environment starting
I: set
  BUILDDIR='/build/reproducible-path'
  BUILDUSERGECOS='first user,first room,first work-phone,first home-phone,first other'
  BUILDUSERNAME='pbuilder1'
  BUILD_ARCH='armhf'
  DEBIAN_FRONTEND='noninteractive'
  DEB_BUILD_OPTIONS='buildinfo=+all reproducible=+all parallel=3 '
  DISTRIBUTION='experimental'
  HOME='/root'
  HOST_ARCH='armhf'
  IFS=' 	
  '
  INVOCATION_ID='8471f6790e874b0f9790bf84a2d75039'
  LANG='C'
  LANGUAGE='en_US:en'
  LC_ALL='C'
  MAIL='/var/mail/root'
  OPTIND='1'
  PATH='/usr/sbin:/usr/bin:/sbin:/bin:/usr/games'
  PBCURRENTCOMMANDLINEOPERATION='build'
  PBUILDER_OPERATION='build'
  PBUILDER_PKGDATADIR='/usr/share/pbuilder'
  PBUILDER_PKGLIBDIR='/usr/lib/pbuilder'
  PBUILDER_SYSCONFDIR='/etc'
  PPID='8498'
  PS1='# '
  PS2='> '
  PS4='+ '
  PWD='/'
  SHELL='/bin/bash'
  SHLVL='2'
  SUDO_COMMAND='/usr/bin/timeout -k 18.1h 18h /usr/bin/ionice -c 3 /usr/bin/nice /usr/sbin/pbuilder --build --configfile /srv/reproducible-results/rbuild-debian/r-b-build.jQbRogIp/pbuilderrc_VUAZ --distribution experimental --hookdir /etc/pbuilder/first-build-hooks --debbuildopts -b --basetgz /var/cache/pbuilder/experimental-reproducible-base.tgz --buildresult /srv/reproducible-results/rbuild-debian/r-b-build.jQbRogIp/b1 --logfile b1/build.log asmjit_0.0~git20231115.1da9e4d-2~exp2.dsc'
  SUDO_GID='110'
  SUDO_UID='103'
  SUDO_USER='jenkins'
  TERM='unknown'
  TZ='/usr/share/zoneinfo/Etc/GMT+12'
  USER='root'
  _='/usr/bin/systemd-run'
  http_proxy='http://10.0.0.15:3142/'
I: uname -a
  Linux virt64z 6.1.0-30-arm64 #1 SMP Debian 6.1.124-1 (2025-01-12) aarch64 GNU/Linux
I: ls -l /bin
  lrwxrwxrwx 1 root root 7 Nov 22 14:40 /bin -> usr/bin
I: user script /srv/workspace/pbuilder/8498/tmp/hooks/D02_print_environment finished
 -> Attempting to satisfy build-dependencies
 -> Creating pbuilder-satisfydepends-dummy package
Package: pbuilder-satisfydepends-dummy
Version: 0.invalid.0
Architecture: armhf
Maintainer: Debian Pbuilder Team <pbuilder-maint@lists.alioth.debian.org>
Description: Dummy package to satisfy dependencies with aptitude - created by pbuilder
 This package was created automatically by pbuilder to satisfy the
 build-dependencies of the package being currently built.
Depends: architecture-is-little-endian, cmake, debhelper-compat (= 13)
dpkg-deb: building package 'pbuilder-satisfydepends-dummy' in '/tmp/satisfydepends-aptitude/pbuilder-satisfydepends-dummy.deb'.
Selecting previously unselected package pbuilder-satisfydepends-dummy.
(Reading database ... 19565 files and directories currently installed.)
Preparing to unpack .../pbuilder-satisfydepends-dummy.deb ...
Unpacking pbuilder-satisfydepends-dummy (0.invalid.0) ...
dpkg: pbuilder-satisfydepends-dummy: dependency problems, but configuring anyway as you requested:
 pbuilder-satisfydepends-dummy depends on architecture-is-little-endian; however:
  Package architecture-is-little-endian is not installed.
 pbuilder-satisfydepends-dummy depends on cmake; however:
  Package cmake is not installed.
 pbuilder-satisfydepends-dummy depends on debhelper-compat (= 13); however:
  Package debhelper-compat is not installed.

Setting up pbuilder-satisfydepends-dummy (0.invalid.0) ...
Reading package lists...
Building dependency tree...
Reading state information...
Initializing package states...
Writing extended state information...
Building tag database...
pbuilder-satisfydepends-dummy is already installed at the requested version (0.invalid.0)
pbuilder-satisfydepends-dummy is already installed at the requested version (0.invalid.0)
The following NEW packages will be installed:
  architecture-properties{a} autoconf{a} automake{a} autopoint{a} autotools-dev{a} bsdextrautils{a} cmake{a} cmake-data{a} debhelper{a} dh-autoreconf{a} dh-strip-nondeterminism{a} dwz{a} file{a} gettext{a} gettext-base{a} groff-base{a} intltool-debian{a} libarchive-zip-perl{a} libarchive13t64{a} libbrotli1{a} libcom-err2{a} libcurl4t64{a} libdebhelper-perl{a} libelf1t64{a} libexpat1{a} libffi8{a} libfile-stripnondeterminism-perl{a} libgnutls30t64{a} libgssapi-krb5-2{a} libicu72{a} libidn2-0{a} libjsoncpp26{a} libk5crypto3{a} libkeyutils1{a} libkrb5-3{a} libkrb5support0{a} libldap2{a} libmagic-mgc{a} libmagic1t64{a} libnghttp2-14{a} libp11-kit0{a} libpipeline1{a} libproc2-0{a} libpsl5t64{a} librhash1{a} librtmp1{a} libsasl2-2{a} libsasl2-modules-db{a} libssh2-1t64{a} libtasn1-6{a} libtool{a} libuchardet0{a} libunistring5{a} libuv1t64{a} libxml2{a} m4{a} man-db{a} po-debconf{a} procps{a} sensible-utils{a} 
The following packages are RECOMMENDED but will NOT be installed:
  ca-certificates curl krb5-locales libarchive-cpio-perl libldap-common libltdl-dev libmail-sendmail-perl libsasl2-modules linux-sysctl-defaults lynx psmisc publicsuffix wget 
0 packages upgraded, 60 newly installed, 0 to remove and 0 not upgraded.
Need to get 33.3 MB of archives. After unpacking 124 MB will be used.
Writing extended state information...
Get: 1 http://deb.debian.org/debian unstable/main armhf libproc2-0 armhf 2:4.0.4-7 [56.3 kB]
Get: 2 http://deb.debian.org/debian unstable/main armhf procps armhf 2:4.0.4-7 [866 kB]
Get: 3 http://deb.debian.org/debian unstable/main armhf sensible-utils all 0.0.24 [24.8 kB]
Get: 4 http://deb.debian.org/debian unstable/main armhf libmagic-mgc armhf 1:5.45-3+b1 [314 kB]
Get: 5 http://deb.debian.org/debian unstable/main armhf libmagic1t64 armhf 1:5.45-3+b1 [98.5 kB]
Get: 6 http://deb.debian.org/debian unstable/main armhf file armhf 1:5.45-3+b1 [42.3 kB]
Get: 7 http://deb.debian.org/debian unstable/main armhf gettext-base armhf 0.23.1-1 [238 kB]
Get: 8 http://deb.debian.org/debian unstable/main armhf libuchardet0 armhf 0.0.8-1+b2 [65.6 kB]
Get: 9 http://deb.debian.org/debian unstable/main armhf groff-base armhf 1.23.0-7 [1095 kB]
Get: 10 http://deb.debian.org/debian unstable/main armhf bsdextrautils armhf 2.40.4-2 [84.6 kB]
Get: 11 http://deb.debian.org/debian unstable/main armhf libpipeline1 armhf 1.5.8-1 [35.0 kB]
Get: 12 http://deb.debian.org/debian unstable/main armhf man-db armhf 2.13.0-1 [1382 kB]
Get: 13 http://deb.debian.org/debian unstable/main armhf architecture-properties armhf 0.2.5 [2276 B]
Get: 14 http://deb.debian.org/debian unstable/main armhf m4 armhf 1.4.19-5 [272 kB]
Get: 15 http://deb.debian.org/debian unstable/main armhf autoconf all 2.72-3 [493 kB]
Get: 16 http://deb.debian.org/debian unstable/main armhf autotools-dev all 20220109.1 [51.6 kB]
Get: 17 http://deb.debian.org/debian unstable/main armhf automake all 1:1.17-3 [862 kB]
Get: 18 http://deb.debian.org/debian unstable/main armhf autopoint all 0.23.1-1 [770 kB]
Get: 19 http://deb.debian.org/debian unstable/main armhf cmake-data all 3.31.5-1 [2267 kB]
Get: 20 http://deb.debian.org/debian unstable/main armhf libicu72 armhf 72.1-6 [9086 kB]
Get: 21 http://deb.debian.org/debian unstable/main armhf libxml2 armhf 2.12.7+dfsg+really2.9.14-0.2+b1 [605 kB]
Get: 22 http://deb.debian.org/debian unstable/main armhf libarchive13t64 armhf 3.7.4-1.1 [306 kB]
Get: 23 http://deb.debian.org/debian unstable/main armhf libbrotli1 armhf 1.1.0-2+b6 [282 kB]
Get: 24 http://deb.debian.org/debian unstable/main armhf libkrb5support0 armhf 1.21.3-4 [30.3 kB]
Get: 25 http://deb.debian.org/debian unstable/main armhf libcom-err2 armhf 1.47.2-1 [23.3 kB]
Get: 26 http://deb.debian.org/debian unstable/main armhf libk5crypto3 armhf 1.21.3-4 [75.8 kB]
Get: 27 http://deb.debian.org/debian unstable/main armhf libkeyutils1 armhf 1.6.3-4 [8096 B]
Get: 28 http://deb.debian.org/debian unstable/main armhf libkrb5-3 armhf 1.21.3-4 [285 kB]
Get: 29 http://deb.debian.org/debian unstable/main armhf libgssapi-krb5-2 armhf 1.21.3-4 [116 kB]
Get: 30 http://deb.debian.org/debian unstable/main armhf libunistring5 armhf 1.3-1 [444 kB]
Get: 31 http://deb.debian.org/debian unstable/main armhf libidn2-0 armhf 2.3.7-2+b1 [125 kB]
Get: 32 http://deb.debian.org/debian unstable/main armhf libsasl2-modules-db armhf 2.1.28+dfsg1-8+b1 [18.6 kB]
Get: 33 http://deb.debian.org/debian unstable/main armhf libsasl2-2 armhf 2.1.28+dfsg1-8+b1 [50.6 kB]
Get: 34 http://deb.debian.org/debian unstable/main armhf libldap2 armhf 2.6.9+dfsg-1 [167 kB]
Get: 35 http://deb.debian.org/debian unstable/main armhf libnghttp2-14 armhf 1.64.0-1 [62.9 kB]
Get: 36 http://deb.debian.org/debian unstable/main armhf libpsl5t64 armhf 0.21.2-1.1+b1 [55.8 kB]
Get: 37 http://deb.debian.org/debian unstable/main armhf libffi8 armhf 3.4.6-1 [20.0 kB]
Get: 38 http://deb.debian.org/debian unstable/main armhf libp11-kit0 armhf 0.25.5-3 [385 kB]
Get: 39 http://deb.debian.org/debian unstable/main armhf libtasn1-6 armhf 4.19.0-3+b3 [43.9 kB]
Get: 40 http://deb.debian.org/debian unstable/main armhf libgnutls30t64 armhf 3.8.8-2 [1370 kB]
Get: 41 http://deb.debian.org/debian unstable/main armhf librtmp1 armhf 2.4+20151223.gitfa8646d.1-2+b5 [53.2 kB]
Get: 42 http://deb.debian.org/debian unstable/main armhf libssh2-1t64 armhf 1.11.1-1 [227 kB]
Get: 43 http://deb.debian.org/debian unstable/main armhf libcurl4t64 armhf 8.11.1-1+b1 [304 kB]
Get: 44 http://deb.debian.org/debian unstable/main armhf libexpat1 armhf 2.6.4-1 [83.5 kB]
Get: 45 http://deb.debian.org/debian unstable/main armhf libjsoncpp26 armhf 1.9.6-3 [69.9 kB]
Get: 46 http://deb.debian.org/debian unstable/main armhf librhash1 armhf 1.4.5-1 [143 kB]
Get: 47 http://deb.debian.org/debian unstable/main armhf libuv1t64 armhf 1.50.0-1 [139 kB]
Get: 48 http://deb.debian.org/debian unstable/main armhf cmake armhf 3.31.5-1 [5911 kB]
Get: 49 http://deb.debian.org/debian unstable/main armhf libdebhelper-perl all 13.24.1 [90.9 kB]
Get: 50 http://deb.debian.org/debian unstable/main armhf libtool all 2.5.4-3 [539 kB]
Get: 51 http://deb.debian.org/debian unstable/main armhf dh-autoreconf all 20 [17.1 kB]
Get: 52 http://deb.debian.org/debian unstable/main armhf libarchive-zip-perl all 1.68-1 [104 kB]
Get: 53 http://deb.debian.org/debian unstable/main armhf libfile-stripnondeterminism-perl all 1.14.1-1 [19.6 kB]
Get: 54 http://deb.debian.org/debian unstable/main armhf dh-strip-nondeterminism all 1.14.1-1 [8584 B]
Get: 55 http://deb.debian.org/debian unstable/main armhf libelf1t64 armhf 0.192-4 [184 kB]
Get: 56 http://deb.debian.org/debian unstable/main armhf dwz armhf 0.15-1+b2 [106 kB]
Get: 57 http://deb.debian.org/debian unstable/main armhf gettext armhf 0.23.1-1 [1560 kB]
Get: 58 http://deb.debian.org/debian unstable/main armhf intltool-debian all 0.35.0+20060710.6 [22.9 kB]
Get: 59 http://deb.debian.org/debian unstable/main armhf po-debconf all 1.0.21+nmu1 [248 kB]
Get: 60 http://deb.debian.org/debian unstable/main armhf debhelper all 13.24.1 [920 kB]
Fetched 33.3 MB in 3s (11.1 MB/s)
Preconfiguring packages ...
Selecting previously unselected package libproc2-0:armhf.
(Reading database ... 
(Reading database ... 5%
(Reading database ... 10%
(Reading database ... 15%
(Reading database ... 20%
(Reading database ... 25%
(Reading database ... 30%
(Reading database ... 35%
(Reading database ... 40%
(Reading database ... 45%
(Reading database ... 50%
(Reading database ... 55%
(Reading database ... 60%
(Reading database ... 65%
(Reading database ... 70%
(Reading database ... 75%
(Reading database ... 80%
(Reading database ... 85%
(Reading database ... 90%
(Reading database ... 95%
(Reading database ... 100%
(Reading database ... 19565 files and directories currently installed.)
Preparing to unpack .../00-libproc2-0_2%3a4.0.4-7_armhf.deb ...
Unpacking libproc2-0:armhf (2:4.0.4-7) ...
Selecting previously unselected package procps.
Preparing to unpack .../01-procps_2%3a4.0.4-7_armhf.deb ...
Unpacking procps (2:4.0.4-7) ...
Selecting previously unselected package sensible-utils.
Preparing to unpack .../02-sensible-utils_0.0.24_all.deb ...
Unpacking sensible-utils (0.0.24) ...
Selecting previously unselected package libmagic-mgc.
Preparing to unpack .../03-libmagic-mgc_1%3a5.45-3+b1_armhf.deb ...
Unpacking libmagic-mgc (1:5.45-3+b1) ...
Selecting previously unselected package libmagic1t64:armhf.
Preparing to unpack .../04-libmagic1t64_1%3a5.45-3+b1_armhf.deb ...
Unpacking libmagic1t64:armhf (1:5.45-3+b1) ...
Selecting previously unselected package file.
Preparing to unpack .../05-file_1%3a5.45-3+b1_armhf.deb ...
Unpacking file (1:5.45-3+b1) ...
Selecting previously unselected package gettext-base.
Preparing to unpack .../06-gettext-base_0.23.1-1_armhf.deb ...
Unpacking gettext-base (0.23.1-1) ...
Selecting previously unselected package libuchardet0:armhf.
Preparing to unpack .../07-libuchardet0_0.0.8-1+b2_armhf.deb ...
Unpacking libuchardet0:armhf (0.0.8-1+b2) ...
Selecting previously unselected package groff-base.
Preparing to unpack .../08-groff-base_1.23.0-7_armhf.deb ...
Unpacking groff-base (1.23.0-7) ...
Selecting previously unselected package bsdextrautils.
Preparing to unpack .../09-bsdextrautils_2.40.4-2_armhf.deb ...
Unpacking bsdextrautils (2.40.4-2) ...
Selecting previously unselected package libpipeline1:armhf.
Preparing to unpack .../10-libpipeline1_1.5.8-1_armhf.deb ...
Unpacking libpipeline1:armhf (1.5.8-1) ...
Selecting previously unselected package man-db.
Preparing to unpack .../11-man-db_2.13.0-1_armhf.deb ...
Unpacking man-db (2.13.0-1) ...
Selecting previously unselected package architecture-properties:armhf.
Preparing to unpack .../12-architecture-properties_0.2.5_armhf.deb ...
Unpacking architecture-properties:armhf (0.2.5) ...
Selecting previously unselected package m4.
Preparing to unpack .../13-m4_1.4.19-5_armhf.deb ...
Unpacking m4 (1.4.19-5) ...
Selecting previously unselected package autoconf.
Preparing to unpack .../14-autoconf_2.72-3_all.deb ...
Unpacking autoconf (2.72-3) ...
Selecting previously unselected package autotools-dev.
Preparing to unpack .../15-autotools-dev_20220109.1_all.deb ...
Unpacking autotools-dev (20220109.1) ...
Selecting previously unselected package automake.
Preparing to unpack .../16-automake_1%3a1.17-3_all.deb ...
Unpacking automake (1:1.17-3) ...
Selecting previously unselected package autopoint.
Preparing to unpack .../17-autopoint_0.23.1-1_all.deb ...
Unpacking autopoint (0.23.1-1) ...
Selecting previously unselected package cmake-data.
Preparing to unpack .../18-cmake-data_3.31.5-1_all.deb ...
Unpacking cmake-data (3.31.5-1) ...
Selecting previously unselected package libicu72:armhf.
Preparing to unpack .../19-libicu72_72.1-6_armhf.deb ...
Unpacking libicu72:armhf (72.1-6) ...
Selecting previously unselected package libxml2:armhf.
Preparing to unpack .../20-libxml2_2.12.7+dfsg+really2.9.14-0.2+b1_armhf.deb ...
Unpacking libxml2:armhf (2.12.7+dfsg+really2.9.14-0.2+b1) ...
Selecting previously unselected package libarchive13t64:armhf.
Preparing to unpack .../21-libarchive13t64_3.7.4-1.1_armhf.deb ...
Unpacking libarchive13t64:armhf (3.7.4-1.1) ...
Selecting previously unselected package libbrotli1:armhf.
Preparing to unpack .../22-libbrotli1_1.1.0-2+b6_armhf.deb ...
Unpacking libbrotli1:armhf (1.1.0-2+b6) ...
Selecting previously unselected package libkrb5support0:armhf.
Preparing to unpack .../23-libkrb5support0_1.21.3-4_armhf.deb ...
Unpacking libkrb5support0:armhf (1.21.3-4) ...
Selecting previously unselected package libcom-err2:armhf.
Preparing to unpack .../24-libcom-err2_1.47.2-1_armhf.deb ...
Unpacking libcom-err2:armhf (1.47.2-1) ...
Selecting previously unselected package libk5crypto3:armhf.
Preparing to unpack .../25-libk5crypto3_1.21.3-4_armhf.deb ...
Unpacking libk5crypto3:armhf (1.21.3-4) ...
Selecting previously unselected package libkeyutils1:armhf.
Preparing to unpack .../26-libkeyutils1_1.6.3-4_armhf.deb ...
Unpacking libkeyutils1:armhf (1.6.3-4) ...
Selecting previously unselected package libkrb5-3:armhf.
Preparing to unpack .../27-libkrb5-3_1.21.3-4_armhf.deb ...
Unpacking libkrb5-3:armhf (1.21.3-4) ...
Selecting previously unselected package libgssapi-krb5-2:armhf.
Preparing to unpack .../28-libgssapi-krb5-2_1.21.3-4_armhf.deb ...
Unpacking libgssapi-krb5-2:armhf (1.21.3-4) ...
Selecting previously unselected package libunistring5:armhf.
Preparing to unpack .../29-libunistring5_1.3-1_armhf.deb ...
Unpacking libunistring5:armhf (1.3-1) ...
Selecting previously unselected package libidn2-0:armhf.
Preparing to unpack .../30-libidn2-0_2.3.7-2+b1_armhf.deb ...
Unpacking libidn2-0:armhf (2.3.7-2+b1) ...
Selecting previously unselected package libsasl2-modules-db:armhf.
Preparing to unpack .../31-libsasl2-modules-db_2.1.28+dfsg1-8+b1_armhf.deb ...
Unpacking libsasl2-modules-db:armhf (2.1.28+dfsg1-8+b1) ...
Selecting previously unselected package libsasl2-2:armhf.
Preparing to unpack .../32-libsasl2-2_2.1.28+dfsg1-8+b1_armhf.deb ...
Unpacking libsasl2-2:armhf (2.1.28+dfsg1-8+b1) ...
Selecting previously unselected package libldap2:armhf.
Preparing to unpack .../33-libldap2_2.6.9+dfsg-1_armhf.deb ...
Unpacking libldap2:armhf (2.6.9+dfsg-1) ...
Selecting previously unselected package libnghttp2-14:armhf.
Preparing to unpack .../34-libnghttp2-14_1.64.0-1_armhf.deb ...
Unpacking libnghttp2-14:armhf (1.64.0-1) ...
Selecting previously unselected package libpsl5t64:armhf.
Preparing to unpack .../35-libpsl5t64_0.21.2-1.1+b1_armhf.deb ...
Unpacking libpsl5t64:armhf (0.21.2-1.1+b1) ...
Selecting previously unselected package libffi8:armhf.
Preparing to unpack .../36-libffi8_3.4.6-1_armhf.deb ...
Unpacking libffi8:armhf (3.4.6-1) ...
Selecting previously unselected package libp11-kit0:armhf.
Preparing to unpack .../37-libp11-kit0_0.25.5-3_armhf.deb ...
Unpacking libp11-kit0:armhf (0.25.5-3) ...
Selecting previously unselected package libtasn1-6:armhf.
Preparing to unpack .../38-libtasn1-6_4.19.0-3+b3_armhf.deb ...
Unpacking libtasn1-6:armhf (4.19.0-3+b3) ...
Selecting previously unselected package libgnutls30t64:armhf.
Preparing to unpack .../39-libgnutls30t64_3.8.8-2_armhf.deb ...
Unpacking libgnutls30t64:armhf (3.8.8-2) ...
Selecting previously unselected package librtmp1:armhf.
Preparing to unpack .../40-librtmp1_2.4+20151223.gitfa8646d.1-2+b5_armhf.deb ...
Unpacking librtmp1:armhf (2.4+20151223.gitfa8646d.1-2+b5) ...
Selecting previously unselected package libssh2-1t64:armhf.
Preparing to unpack .../41-libssh2-1t64_1.11.1-1_armhf.deb ...
Unpacking libssh2-1t64:armhf (1.11.1-1) ...
Selecting previously unselected package libcurl4t64:armhf.
Preparing to unpack .../42-libcurl4t64_8.11.1-1+b1_armhf.deb ...
Unpacking libcurl4t64:armhf (8.11.1-1+b1) ...
Selecting previously unselected package libexpat1:armhf.
Preparing to unpack .../43-libexpat1_2.6.4-1_armhf.deb ...
Unpacking libexpat1:armhf (2.6.4-1) ...
Selecting previously unselected package libjsoncpp26:armhf.
Preparing to unpack .../44-libjsoncpp26_1.9.6-3_armhf.deb ...
Unpacking libjsoncpp26:armhf (1.9.6-3) ...
Selecting previously unselected package librhash1:armhf.
Preparing to unpack .../45-librhash1_1.4.5-1_armhf.deb ...
Unpacking librhash1:armhf (1.4.5-1) ...
Selecting previously unselected package libuv1t64:armhf.
Preparing to unpack .../46-libuv1t64_1.50.0-1_armhf.deb ...
Unpacking libuv1t64:armhf (1.50.0-1) ...
Selecting previously unselected package cmake.
Preparing to unpack .../47-cmake_3.31.5-1_armhf.deb ...
Unpacking cmake (3.31.5-1) ...
Selecting previously unselected package libdebhelper-perl.
Preparing to unpack .../48-libdebhelper-perl_13.24.1_all.deb ...
Unpacking libdebhelper-perl (13.24.1) ...
Selecting previously unselected package libtool.
Preparing to unpack .../49-libtool_2.5.4-3_all.deb ...
Unpacking libtool (2.5.4-3) ...
Selecting previously unselected package dh-autoreconf.
Preparing to unpack .../50-dh-autoreconf_20_all.deb ...
Unpacking dh-autoreconf (20) ...
Selecting previously unselected package libarchive-zip-perl.
Preparing to unpack .../51-libarchive-zip-perl_1.68-1_all.deb ...
Unpacking libarchive-zip-perl (1.68-1) ...
Selecting previously unselected package libfile-stripnondeterminism-perl.
Preparing to unpack .../52-libfile-stripnondeterminism-perl_1.14.1-1_all.deb ...
Unpacking libfile-stripnondeterminism-perl (1.14.1-1) ...
Selecting previously unselected package dh-strip-nondeterminism.
Preparing to unpack .../53-dh-strip-nondeterminism_1.14.1-1_all.deb ...
Unpacking dh-strip-nondeterminism (1.14.1-1) ...
Selecting previously unselected package libelf1t64:armhf.
Preparing to unpack .../54-libelf1t64_0.192-4_armhf.deb ...
Unpacking libelf1t64:armhf (0.192-4) ...
Selecting previously unselected package dwz.
Preparing to unpack .../55-dwz_0.15-1+b2_armhf.deb ...
Unpacking dwz (0.15-1+b2) ...
Selecting previously unselected package gettext.
Preparing to unpack .../56-gettext_0.23.1-1_armhf.deb ...
Unpacking gettext (0.23.1-1) ...
Selecting previously unselected package intltool-debian.
Preparing to unpack .../57-intltool-debian_0.35.0+20060710.6_all.deb ...
Unpacking intltool-debian (0.35.0+20060710.6) ...
Selecting previously unselected package po-debconf.
Preparing to unpack .../58-po-debconf_1.0.21+nmu1_all.deb ...
Unpacking po-debconf (1.0.21+nmu1) ...
Selecting previously unselected package debhelper.
Preparing to unpack .../59-debhelper_13.24.1_all.deb ...
Unpacking debhelper (13.24.1) ...
Setting up libexpat1:armhf (2.6.4-1) ...
Setting up libpipeline1:armhf (1.5.8-1) ...
Setting up libkeyutils1:armhf (1.6.3-4) ...
Setting up libicu72:armhf (72.1-6) ...
Setting up bsdextrautils (2.40.4-2) ...
Setting up libmagic-mgc (1:5.45-3+b1) ...
Setting up libarchive-zip-perl (1.68-1) ...
Setting up architecture-properties:armhf (0.2.5) ...
Setting up libdebhelper-perl (13.24.1) ...
Setting up libbrotli1:armhf (1.1.0-2+b6) ...
Setting up libuv1t64:armhf (1.50.0-1) ...
Setting up libmagic1t64:armhf (1:5.45-3+b1) ...
Setting up libnghttp2-14:armhf (1.64.0-1) ...
Setting up gettext-base (0.23.1-1) ...
Setting up m4 (1.4.19-5) ...
Setting up libcom-err2:armhf (1.47.2-1) ...
Setting up file (1:5.45-3+b1) ...
Setting up libelf1t64:armhf (0.192-4) ...
Setting up libkrb5support0:armhf (1.21.3-4) ...
Setting up libsasl2-modules-db:armhf (2.1.28+dfsg1-8+b1) ...
Setting up autotools-dev (20220109.1) ...
Setting up libjsoncpp26:armhf (1.9.6-3) ...
Setting up libproc2-0:armhf (2:4.0.4-7) ...
Setting up libunistring5:armhf (1.3-1) ...
Setting up autopoint (0.23.1-1) ...
Setting up libk5crypto3:armhf (1.21.3-4) ...
Setting up libsasl2-2:armhf (2.1.28+dfsg1-8+b1) ...
Setting up autoconf (2.72-3) ...
Setting up libffi8:armhf (3.4.6-1) ...
Setting up dwz (0.15-1+b2) ...
Setting up sensible-utils (0.0.24) ...
Setting up libuchardet0:armhf (0.0.8-1+b2) ...
Setting up procps (2:4.0.4-7) ...
Setting up libtasn1-6:armhf (4.19.0-3+b3) ...
Setting up cmake-data (3.31.5-1) ...
Setting up librhash1:armhf (1.4.5-1) ...
Setting up libkrb5-3:armhf (1.21.3-4) ...
Setting up libssh2-1t64:armhf (1.11.1-1) ...
Setting up libxml2:armhf (2.12.7+dfsg+really2.9.14-0.2+b1) ...
Setting up libldap2:armhf (2.6.9+dfsg-1) ...
Setting up automake (1:1.17-3) ...
update-alternatives: using /usr/bin/automake-1.17 to provide /usr/bin/automake (automake) in auto mode
Setting up libfile-stripnondeterminism-perl (1.14.1-1) ...
Setting up gettext (0.23.1-1) ...
Setting up libtool (2.5.4-3) ...
Setting up libidn2-0:armhf (2.3.7-2+b1) ...
Setting up intltool-debian (0.35.0+20060710.6) ...
Setting up dh-autoreconf (20) ...
Setting up libp11-kit0:armhf (0.25.5-3) ...
Setting up libgssapi-krb5-2:armhf (1.21.3-4) ...
Setting up dh-strip-nondeterminism (1.14.1-1) ...
Setting up groff-base (1.23.0-7) ...
Setting up libarchive13t64:armhf (3.7.4-1.1) ...
Setting up libgnutls30t64:armhf (3.8.8-2) ...
Setting up po-debconf (1.0.21+nmu1) ...
Setting up libpsl5t64:armhf (0.21.2-1.1+b1) ...
Setting up man-db (2.13.0-1) ...
Not building database; man-db/auto-update is not 'true'.
Setting up librtmp1:armhf (2.4+20151223.gitfa8646d.1-2+b5) ...
Setting up libcurl4t64:armhf (8.11.1-1+b1) ...
Setting up debhelper (13.24.1) ...
Setting up cmake (3.31.5-1) ...
Processing triggers for libc-bin (2.40-6) ...
Reading package lists...
Building dependency tree...
Reading state information...
Reading extended state information...
Initializing package states...
Writing extended state information...
Building tag database...
 -> Finished parsing the build-deps
I: Building the package
I: Running cd /build/reproducible-path/asmjit-0.0~git20231115.1da9e4d/ && env PATH="/usr/sbin:/usr/bin:/sbin:/bin:/usr/games" HOME="/nonexistent/first-build" dpkg-buildpackage -us -uc -b && env PATH="/usr/sbin:/usr/bin:/sbin:/bin:/usr/games" HOME="/nonexistent/first-build" dpkg-genchanges -S  > ../asmjit_0.0~git20231115.1da9e4d-2~exp2_source.changes
dpkg-buildpackage: info: source package asmjit
dpkg-buildpackage: info: source version 0.0~git20231115.1da9e4d-2~exp2
dpkg-buildpackage: info: source distribution experimental
dpkg-buildpackage: info: source changed by Andrius Merkys <merkys@debian.org>
 dpkg-source --before-build .
dpkg-buildpackage: info: host architecture armhf
 debian/rules clean
dh clean
   dh_clean
 debian/rules binary
dh binary
   dh_update_autotools_config
   dh_autoreconf
   debian/rules override_dh_auto_configure
make[1]: Entering directory '/build/reproducible-path/asmjit-0.0~git20231115.1da9e4d'
dh_auto_configure -- -DASMJIT_STATIC=ON -DASMJIT_TEST=ON -DCMAKE_VERBOSE_MAKEFILE=ON
	cd obj-arm-linux-gnueabihf && DEB_PYTHON_INSTALL_LAYOUT=deb PKG_CONFIG=/usr/bin/pkg-config cmake -DCMAKE_INSTALL_PREFIX=/usr -DCMAKE_BUILD_TYPE=None -DCMAKE_INSTALL_SYSCONFDIR=/etc -DCMAKE_INSTALL_LOCALSTATEDIR=/var -DCMAKE_EXPORT_NO_PACKAGE_REGISTRY=ON -DCMAKE_FIND_USE_PACKAGE_REGISTRY=OFF -DCMAKE_FIND_PACKAGE_NO_PACKAGE_REGISTRY=ON -DFETCHCONTENT_FULLY_DISCONNECTED=ON -DCMAKE_INSTALL_RUNSTATEDIR=/run -DCMAKE_SKIP_INSTALL_ALL_DEPENDENCY=ON "-GUnix Makefiles" -DCMAKE_VERBOSE_MAKEFILE=ON -DCMAKE_INSTALL_LIBDIR=lib/arm-linux-gnueabihf -DASMJIT_STATIC=ON -DASMJIT_TEST=ON -DCMAKE_VERBOSE_MAKEFILE=ON ..
CMake Deprecation Warning at CMakeLists.txt:1 (cmake_minimum_required):
  Compatibility with CMake < 3.10 will be removed from a future version of
  CMake.

  Update the VERSION argument <min> value.  Or, use the <min>...<max> syntax
  to tell CMake that the project requires at least <min> but has been updated
  to work with policies introduced by <max> or earlier.


-- The CXX compiler identification is GNU 14.2.0
-- Detecting CXX compiler ABI info
-- Detecting CXX compiler ABI info - done
-- Check for working CXX compiler: /usr/bin/c++ - skipped
-- Detecting CXX compile features
-- Detecting CXX compile features - done
-- Performing Test __CxxFlag__fno_threadsafe_statics
-- Performing Test __CxxFlag__fno_threadsafe_statics - Success
-- Performing Test __CxxFlag__fno_semantic_interposition
-- Performing Test __CxxFlag__fno_semantic_interposition - Success
-- Performing Test __CxxFlag__fmerge_all_constants
-- Performing Test __CxxFlag__fmerge_all_constants - Success
-- Performing Test __CxxFlag__fno_enforce_eh_specs
-- Performing Test __CxxFlag__fno_enforce_eh_specs - Success
** AsmJit Summary **
   ASMJIT_DIR=/build/reproducible-path/asmjit-0.0~git20231115.1da9e4d
   ASMJIT_TEST=ON
   ASMJIT_TARGET_TYPE=STATIC
   ASMJIT_DEPS=pthread;rt
   ASMJIT_LIBS=asmjit;pthread;rt
   ASMJIT_CFLAGS=-DASMJIT_STATIC
   ASMJIT_PRIVATE_CFLAGS=-Wall;-Wextra;-Wconversion;-fno-math-errno;-fno-threadsafe-statics;-fno-semantic-interposition;-DASMJIT_STATIC
   ASMJIT_PRIVATE_CFLAGS_DBG=
   ASMJIT_PRIVATE_CFLAGS_REL=-O2;-fmerge-all-constants;-fno-enforce-eh-specs
-- Performing Test __CxxFlag__msse2
-- Performing Test __CxxFlag__msse2 - Failed
-- Configuring done (1.9s)
-- Generating done (0.1s)
CMake Warning:
  Manually-specified variables were not used by the project:

    CMAKE_EXPORT_NO_PACKAGE_REGISTRY
    CMAKE_FIND_PACKAGE_NO_PACKAGE_REGISTRY
    CMAKE_FIND_USE_PACKAGE_REGISTRY
    FETCHCONTENT_FULLY_DISCONNECTED


-- Build files have been written to: /build/reproducible-path/asmjit-0.0~git20231115.1da9e4d/obj-arm-linux-gnueabihf
make[1]: Leaving directory '/build/reproducible-path/asmjit-0.0~git20231115.1da9e4d'
   dh_auto_build
	cd obj-arm-linux-gnueabihf && make -j3 "INSTALL=install --strip-program=true" VERBOSE=1
make[1]: Entering directory '/build/reproducible-path/asmjit-0.0~git20231115.1da9e4d/obj-arm-linux-gnueabihf'
/usr/bin/cmake -S"/build/reproducible-path/asmjit-0.0~git20231115.1da9e4d" -B"/build/reproducible-path/asmjit-0.0~git20231115.1da9e4d/obj-arm-linux-gnueabihf" --check-build-system CMakeFiles/Makefile.cmake 0
/usr/bin/cmake -E cmake_progress_start "/build/reproducible-path/asmjit-0.0~git20231115.1da9e4d/obj-arm-linux-gnueabihf/CMakeFiles" "/build/reproducible-path/asmjit-0.0~git20231115.1da9e4d/obj-arm-linux-gnueabihf//CMakeFiles/progress.marks"
make  -f CMakeFiles/Makefile2 all
make[2]: Entering directory '/build/reproducible-path/asmjit-0.0~git20231115.1da9e4d/obj-arm-linux-gnueabihf'
make  -f CMakeFiles/asmjit.dir/build.make CMakeFiles/asmjit.dir/depend
make  -f CMakeFiles/asmjit_test_unit.dir/build.make CMakeFiles/asmjit_test_unit.dir/depend
make[3]: Entering directory '/build/reproducible-path/asmjit-0.0~git20231115.1da9e4d/obj-arm-linux-gnueabihf'
cd "/build/reproducible-path/asmjit-0.0~git20231115.1da9e4d/obj-arm-linux-gnueabihf" && /usr/bin/cmake -E cmake_depends "Unix Makefiles" "/build/reproducible-path/asmjit-0.0~git20231115.1da9e4d" "/build/reproducible-path/asmjit-0.0~git20231115.1da9e4d" "/build/reproducible-path/asmjit-0.0~git20231115.1da9e4d/obj-arm-linux-gnueabihf" "/build/reproducible-path/asmjit-0.0~git20231115.1da9e4d/obj-arm-linux-gnueabihf" "/build/reproducible-path/asmjit-0.0~git20231115.1da9e4d/obj-arm-linux-gnueabihf/CMakeFiles/asmjit.dir/DependInfo.cmake" "--color="
make[3]: Entering directory '/build/reproducible-path/asmjit-0.0~git20231115.1da9e4d/obj-arm-linux-gnueabihf'
cd "/build/reproducible-path/asmjit-0.0~git20231115.1da9e4d/obj-arm-linux-gnueabihf" && /usr/bin/cmake -E cmake_depends "Unix Makefiles" "/build/reproducible-path/asmjit-0.0~git20231115.1da9e4d" "/build/reproducible-path/asmjit-0.0~git20231115.1da9e4d" "/build/reproducible-path/asmjit-0.0~git20231115.1da9e4d/obj-arm-linux-gnueabihf" "/build/reproducible-path/asmjit-0.0~git20231115.1da9e4d/obj-arm-linux-gnueabihf" "/build/reproducible-path/asmjit-0.0~git20231115.1da9e4d/obj-arm-linux-gnueabihf/CMakeFiles/asmjit_test_unit.dir/DependInfo.cmake" "--color="
make[3]: Leaving directory '/build/reproducible-path/asmjit-0.0~git20231115.1da9e4d/obj-arm-linux-gnueabihf'
make[3]: Leaving directory '/build/reproducible-path/asmjit-0.0~git20231115.1da9e4d/obj-arm-linux-gnueabihf'
make  -f CMakeFiles/asmjit_test_unit.dir/build.make CMakeFiles/asmjit_test_unit.dir/build
make  -f CMakeFiles/asmjit.dir/build.make CMakeFiles/asmjit.dir/build
make[3]: Entering directory '/build/reproducible-path/asmjit-0.0~git20231115.1da9e4d/obj-arm-linux-gnueabihf'
make[3]: Entering directory '/build/reproducible-path/asmjit-0.0~git20231115.1da9e4d/obj-arm-linux-gnueabihf'
[  0%] Building CXX object CMakeFiles/asmjit.dir/src/asmjit/core/archtraits.cpp.o
[  1%] Building CXX object CMakeFiles/asmjit_test_unit.dir/src/asmjit/core/archtraits.cpp.o
[  2%] Building CXX object CMakeFiles/asmjit.dir/src/asmjit/core/assembler.cpp.o
/usr/bin/c++  -I"/build/reproducible-path/asmjit-0.0~git20231115.1da9e4d/src" -g -O2 -ffile-prefix-map=/build/reproducible-path/asmjit-0.0~git20231115.1da9e4d=. -fstack-protector-strong -fstack-clash-protection -Wformat -Werror=format-security -D_LARGEFILE_SOURCE -D_FILE_OFFSET_BITS=64 -D_TIME_BITS=64 -Wdate-time -D_FORTIFY_SOURCE=2 -fvisibility=hidden -Wall -Wextra -Wconversion -fno-math-errno -fno-threadsafe-statics -fno-semantic-interposition -DASMJIT_STATIC -DASMJIT_TEST -O2 -fmerge-all-constants -fno-enforce-eh-specs -MD -MT CMakeFiles/asmjit_test_unit.dir/src/asmjit/core/archtraits.cpp.o -MF CMakeFiles/asmjit_test_unit.dir/src/asmjit/core/archtraits.cpp.o.d -o CMakeFiles/asmjit_test_unit.dir/src/asmjit/core/archtraits.cpp.o -c "/build/reproducible-path/asmjit-0.0~git20231115.1da9e4d/src/asmjit/core/archtraits.cpp"
/usr/bin/c++   -g -O2 -ffile-prefix-map=/build/reproducible-path/asmjit-0.0~git20231115.1da9e4d=. -fstack-protector-strong -fstack-clash-protection -Wformat -Werror=format-security -D_LARGEFILE_SOURCE -D_FILE_OFFSET_BITS=64 -D_TIME_BITS=64 -Wdate-time -D_FORTIFY_SOURCE=2 -fvisibility=hidden -Wall -Wextra -Wconversion -fno-math-errno -fno-threadsafe-statics -fno-semantic-interposition -DASMJIT_STATIC -O2 -fmerge-all-constants -fno-enforce-eh-specs -MD -MT CMakeFiles/asmjit.dir/src/asmjit/core/archtraits.cpp.o -MF CMakeFiles/asmjit.dir/src/asmjit/core/archtraits.cpp.o.d -o CMakeFiles/asmjit.dir/src/asmjit/core/archtraits.cpp.o -c "/build/reproducible-path/asmjit-0.0~git20231115.1da9e4d/src/asmjit/core/archtraits.cpp"
/usr/bin/c++   -g -O2 -ffile-prefix-map=/build/reproducible-path/asmjit-0.0~git20231115.1da9e4d=. -fstack-protector-strong -fstack-clash-protection -Wformat -Werror=format-security -D_LARGEFILE_SOURCE -D_FILE_OFFSET_BITS=64 -D_TIME_BITS=64 -Wdate-time -D_FORTIFY_SOURCE=2 -fvisibility=hidden -Wall -Wextra -Wconversion -fno-math-errno -fno-threadsafe-statics -fno-semantic-interposition -DASMJIT_STATIC -O2 -fmerge-all-constants -fno-enforce-eh-specs -MD -MT CMakeFiles/asmjit.dir/src/asmjit/core/assembler.cpp.o -MF CMakeFiles/asmjit.dir/src/asmjit/core/assembler.cpp.o.d -o CMakeFiles/asmjit.dir/src/asmjit/core/assembler.cpp.o -c "/build/reproducible-path/asmjit-0.0~git20231115.1da9e4d/src/asmjit/core/assembler.cpp"
[  3%] Building CXX object CMakeFiles/asmjit_test_unit.dir/src/asmjit/core/assembler.cpp.o
/usr/bin/c++  -I"/build/reproducible-path/asmjit-0.0~git20231115.1da9e4d/src" -g -O2 -ffile-prefix-map=/build/reproducible-path/asmjit-0.0~git20231115.1da9e4d=. -fstack-protector-strong -fstack-clash-protection -Wformat -Werror=format-security -D_LARGEFILE_SOURCE -D_FILE_OFFSET_BITS=64 -D_TIME_BITS=64 -Wdate-time -D_FORTIFY_SOURCE=2 -fvisibility=hidden -Wall -Wextra -Wconversion -fno-math-errno -fno-threadsafe-statics -fno-semantic-interposition -DASMJIT_STATIC -DASMJIT_TEST -O2 -fmerge-all-constants -fno-enforce-eh-specs -MD -MT CMakeFiles/asmjit_test_unit.dir/src/asmjit/core/assembler.cpp.o -MF CMakeFiles/asmjit_test_unit.dir/src/asmjit/core/assembler.cpp.o.d -o CMakeFiles/asmjit_test_unit.dir/src/asmjit/core/assembler.cpp.o -c "/build/reproducible-path/asmjit-0.0~git20231115.1da9e4d/src/asmjit/core/assembler.cpp"
[  4%] Building CXX object CMakeFiles/asmjit.dir/src/asmjit/core/builder.cpp.o
/usr/bin/c++   -g -O2 -ffile-prefix-map=/build/reproducible-path/asmjit-0.0~git20231115.1da9e4d=. -fstack-protector-strong -fstack-clash-protection -Wformat -Werror=format-security -D_LARGEFILE_SOURCE -D_FILE_OFFSET_BITS=64 -D_TIME_BITS=64 -Wdate-time -D_FORTIFY_SOURCE=2 -fvisibility=hidden -Wall -Wextra -Wconversion -fno-math-errno -fno-threadsafe-statics -fno-semantic-interposition -DASMJIT_STATIC -O2 -fmerge-all-constants -fno-enforce-eh-specs -MD -MT CMakeFiles/asmjit.dir/src/asmjit/core/builder.cpp.o -MF CMakeFiles/asmjit.dir/src/asmjit/core/builder.cpp.o.d -o CMakeFiles/asmjit.dir/src/asmjit/core/builder.cpp.o -c "/build/reproducible-path/asmjit-0.0~git20231115.1da9e4d/src/asmjit/core/builder.cpp"
[  4%] Building CXX object CMakeFiles/asmjit.dir/src/asmjit/core/codeholder.cpp.o
/usr/bin/c++   -g -O2 -ffile-prefix-map=/build/reproducible-path/asmjit-0.0~git20231115.1da9e4d=. -fstack-protector-strong -fstack-clash-protection -Wformat -Werror=format-security -D_LARGEFILE_SOURCE -D_FILE_OFFSET_BITS=64 -D_TIME_BITS=64 -Wdate-time -D_FORTIFY_SOURCE=2 -fvisibility=hidden -Wall -Wextra -Wconversion -fno-math-errno -fno-threadsafe-statics -fno-semantic-interposition -DASMJIT_STATIC -O2 -fmerge-all-constants -fno-enforce-eh-specs -MD -MT CMakeFiles/asmjit.dir/src/asmjit/core/codeholder.cpp.o -MF CMakeFiles/asmjit.dir/src/asmjit/core/codeholder.cpp.o.d -o CMakeFiles/asmjit.dir/src/asmjit/core/codeholder.cpp.o -c "/build/reproducible-path/asmjit-0.0~git20231115.1da9e4d/src/asmjit/core/codeholder.cpp"
[  4%] Building CXX object CMakeFiles/asmjit_test_unit.dir/src/asmjit/core/builder.cpp.o
/usr/bin/c++  -I"/build/reproducible-path/asmjit-0.0~git20231115.1da9e4d/src" -g -O2 -ffile-prefix-map=/build/reproducible-path/asmjit-0.0~git20231115.1da9e4d=. -fstack-protector-strong -fstack-clash-protection -Wformat -Werror=format-security -D_LARGEFILE_SOURCE -D_FILE_OFFSET_BITS=64 -D_TIME_BITS=64 -Wdate-time -D_FORTIFY_SOURCE=2 -fvisibility=hidden -Wall -Wextra -Wconversion -fno-math-errno -fno-threadsafe-statics -fno-semantic-interposition -DASMJIT_STATIC -DASMJIT_TEST -O2 -fmerge-all-constants -fno-enforce-eh-specs -MD -MT CMakeFiles/asmjit_test_unit.dir/src/asmjit/core/builder.cpp.o -MF CMakeFiles/asmjit_test_unit.dir/src/asmjit/core/builder.cpp.o.d -o CMakeFiles/asmjit_test_unit.dir/src/asmjit/core/builder.cpp.o -c "/build/reproducible-path/asmjit-0.0~git20231115.1da9e4d/src/asmjit/core/builder.cpp"
[  5%] Building CXX object CMakeFiles/asmjit.dir/src/asmjit/core/codewriter.cpp.o
/usr/bin/c++   -g -O2 -ffile-prefix-map=/build/reproducible-path/asmjit-0.0~git20231115.1da9e4d=. -fstack-protector-strong -fstack-clash-protection -Wformat -Werror=format-security -D_LARGEFILE_SOURCE -D_FILE_OFFSET_BITS=64 -D_TIME_BITS=64 -Wdate-time -D_FORTIFY_SOURCE=2 -fvisibility=hidden -Wall -Wextra -Wconversion -fno-math-errno -fno-threadsafe-statics -fno-semantic-interposition -DASMJIT_STATIC -O2 -fmerge-all-constants -fno-enforce-eh-specs -MD -MT CMakeFiles/asmjit.dir/src/asmjit/core/codewriter.cpp.o -MF CMakeFiles/asmjit.dir/src/asmjit/core/codewriter.cpp.o.d -o CMakeFiles/asmjit.dir/src/asmjit/core/codewriter.cpp.o -c "/build/reproducible-path/asmjit-0.0~git20231115.1da9e4d/src/asmjit/core/codewriter.cpp"
[  6%] Building CXX object CMakeFiles/asmjit.dir/src/asmjit/core/compiler.cpp.o
/usr/bin/c++   -g -O2 -ffile-prefix-map=/build/reproducible-path/asmjit-0.0~git20231115.1da9e4d=. -fstack-protector-strong -fstack-clash-protection -Wformat -Werror=format-security -D_LARGEFILE_SOURCE -D_FILE_OFFSET_BITS=64 -D_TIME_BITS=64 -Wdate-time -D_FORTIFY_SOURCE=2 -fvisibility=hidden -Wall -Wextra -Wconversion -fno-math-errno -fno-threadsafe-statics -fno-semantic-interposition -DASMJIT_STATIC -O2 -fmerge-all-constants -fno-enforce-eh-specs -MD -MT CMakeFiles/asmjit.dir/src/asmjit/core/compiler.cpp.o -MF CMakeFiles/asmjit.dir/src/asmjit/core/compiler.cpp.o.d -o CMakeFiles/asmjit.dir/src/asmjit/core/compiler.cpp.o -c "/build/reproducible-path/asmjit-0.0~git20231115.1da9e4d/src/asmjit/core/compiler.cpp"
[  7%] Building CXX object CMakeFiles/asmjit.dir/src/asmjit/core/constpool.cpp.o
/usr/bin/c++   -g -O2 -ffile-prefix-map=/build/reproducible-path/asmjit-0.0~git20231115.1da9e4d=. -fstack-protector-strong -fstack-clash-protection -Wformat -Werror=format-security -D_LARGEFILE_SOURCE -D_FILE_OFFSET_BITS=64 -D_TIME_BITS=64 -Wdate-time -D_FORTIFY_SOURCE=2 -fvisibility=hidden -Wall -Wextra -Wconversion -fno-math-errno -fno-threadsafe-statics -fno-semantic-interposition -DASMJIT_STATIC -O2 -fmerge-all-constants -fno-enforce-eh-specs -MD -MT CMakeFiles/asmjit.dir/src/asmjit/core/constpool.cpp.o -MF CMakeFiles/asmjit.dir/src/asmjit/core/constpool.cpp.o.d -o CMakeFiles/asmjit.dir/src/asmjit/core/constpool.cpp.o -c "/build/reproducible-path/asmjit-0.0~git20231115.1da9e4d/src/asmjit/core/constpool.cpp"
[  8%] Building CXX object CMakeFiles/asmjit_test_unit.dir/src/asmjit/core/codeholder.cpp.o
/usr/bin/c++  -I"/build/reproducible-path/asmjit-0.0~git20231115.1da9e4d/src" -g -O2 -ffile-prefix-map=/build/reproducible-path/asmjit-0.0~git20231115.1da9e4d=. -fstack-protector-strong -fstack-clash-protection -Wformat -Werror=format-security -D_LARGEFILE_SOURCE -D_FILE_OFFSET_BITS=64 -D_TIME_BITS=64 -Wdate-time -D_FORTIFY_SOURCE=2 -fvisibility=hidden -Wall -Wextra -Wconversion -fno-math-errno -fno-threadsafe-statics -fno-semantic-interposition -DASMJIT_STATIC -DASMJIT_TEST -O2 -fmerge-all-constants -fno-enforce-eh-specs -MD -MT CMakeFiles/asmjit_test_unit.dir/src/asmjit/core/codeholder.cpp.o -MF CMakeFiles/asmjit_test_unit.dir/src/asmjit/core/codeholder.cpp.o.d -o CMakeFiles/asmjit_test_unit.dir/src/asmjit/core/codeholder.cpp.o -c "/build/reproducible-path/asmjit-0.0~git20231115.1da9e4d/src/asmjit/core/codeholder.cpp"
[  8%] Building CXX object CMakeFiles/asmjit.dir/src/asmjit/core/cpuinfo.cpp.o
/usr/bin/c++   -g -O2 -ffile-prefix-map=/build/reproducible-path/asmjit-0.0~git20231115.1da9e4d=. -fstack-protector-strong -fstack-clash-protection -Wformat -Werror=format-security -D_LARGEFILE_SOURCE -D_FILE_OFFSET_BITS=64 -D_TIME_BITS=64 -Wdate-time -D_FORTIFY_SOURCE=2 -fvisibility=hidden -Wall -Wextra -Wconversion -fno-math-errno -fno-threadsafe-statics -fno-semantic-interposition -DASMJIT_STATIC -O2 -fmerge-all-constants -fno-enforce-eh-specs -MD -MT CMakeFiles/asmjit.dir/src/asmjit/core/cpuinfo.cpp.o -MF CMakeFiles/asmjit.dir/src/asmjit/core/cpuinfo.cpp.o.d -o CMakeFiles/asmjit.dir/src/asmjit/core/cpuinfo.cpp.o -c "/build/reproducible-path/asmjit-0.0~git20231115.1da9e4d/src/asmjit/core/cpuinfo.cpp"
[  9%] Building CXX object CMakeFiles/asmjit.dir/src/asmjit/core/emithelper.cpp.o
/usr/bin/c++   -g -O2 -ffile-prefix-map=/build/reproducible-path/asmjit-0.0~git20231115.1da9e4d=. -fstack-protector-strong -fstack-clash-protection -Wformat -Werror=format-security -D_LARGEFILE_SOURCE -D_FILE_OFFSET_BITS=64 -D_TIME_BITS=64 -Wdate-time -D_FORTIFY_SOURCE=2 -fvisibility=hidden -Wall -Wextra -Wconversion -fno-math-errno -fno-threadsafe-statics -fno-semantic-interposition -DASMJIT_STATIC -O2 -fmerge-all-constants -fno-enforce-eh-specs -MD -MT CMakeFiles/asmjit.dir/src/asmjit/core/emithelper.cpp.o -MF CMakeFiles/asmjit.dir/src/asmjit/core/emithelper.cpp.o.d -o CMakeFiles/asmjit.dir/src/asmjit/core/emithelper.cpp.o -c "/build/reproducible-path/asmjit-0.0~git20231115.1da9e4d/src/asmjit/core/emithelper.cpp"
/build/reproducible-path/asmjit-0.0~git20231115.1da9e4d/src/asmjit/core/cpuinfo.cpp: In function 'void asmjit::_abi_1_11::arm::detectARMCpu(asmjit::_abi_1_11::CpuInfo&)':
/build/reproducible-path/asmjit-0.0~git20231115.1da9e4d/src/asmjit/core/cpuinfo.cpp:1578:20: error: 'hwCap2Masks' was not declared in this scope; did you mean 'hwCapMasks'?
 1578 |   mergeHWCaps(cpu, hwCap2Masks[0], hwCap2Mapping, ASMJIT_ARRAY_SIZE(hwCap2Mapping));
      |                    ^~~~~~~~~~~
      |                    hwCapMasks
make[3]: *** [CMakeFiles/asmjit.dir/build.make:180: CMakeFiles/asmjit.dir/src/asmjit/core/cpuinfo.cpp.o] Error 1
make[3]: *** Waiting for unfinished jobs....
[ 10%] Building CXX object CMakeFiles/asmjit_test_unit.dir/src/asmjit/core/codewriter.cpp.o
/usr/bin/c++  -I"/build/reproducible-path/asmjit-0.0~git20231115.1da9e4d/src" -g -O2 -ffile-prefix-map=/build/reproducible-path/asmjit-0.0~git20231115.1da9e4d=. -fstack-protector-strong -fstack-clash-protection -Wformat -Werror=format-security -D_LARGEFILE_SOURCE -D_FILE_OFFSET_BITS=64 -D_TIME_BITS=64 -Wdate-time -D_FORTIFY_SOURCE=2 -fvisibility=hidden -Wall -Wextra -Wconversion -fno-math-errno -fno-threadsafe-statics -fno-semantic-interposition -DASMJIT_STATIC -DASMJIT_TEST -O2 -fmerge-all-constants -fno-enforce-eh-specs -MD -MT CMakeFiles/asmjit_test_unit.dir/src/asmjit/core/codewriter.cpp.o -MF CMakeFiles/asmjit_test_unit.dir/src/asmjit/core/codewriter.cpp.o.d -o CMakeFiles/asmjit_test_unit.dir/src/asmjit/core/codewriter.cpp.o -c "/build/reproducible-path/asmjit-0.0~git20231115.1da9e4d/src/asmjit/core/codewriter.cpp"
make[3]: Leaving directory '/build/reproducible-path/asmjit-0.0~git20231115.1da9e4d/obj-arm-linux-gnueabihf'
make[2]: *** [CMakeFiles/Makefile2:111: CMakeFiles/asmjit.dir/all] Error 2
make[2]: *** Waiting for unfinished jobs....
[ 11%] Building CXX object CMakeFiles/asmjit_test_unit.dir/src/asmjit/core/constpool.cpp.o
/usr/bin/c++  -I"/build/reproducible-path/asmjit-0.0~git20231115.1da9e4d/src" -g -O2 -ffile-prefix-map=/build/reproducible-path/asmjit-0.0~git20231115.1da9e4d=. -fstack-protector-strong -fstack-clash-protection -Wformat -Werror=format-security -D_LARGEFILE_SOURCE -D_FILE_OFFSET_BITS=64 -D_TIME_BITS=64 -Wdate-time -D_FORTIFY_SOURCE=2 -fvisibility=hidden -Wall -Wextra -Wconversion -fno-math-errno -fno-threadsafe-statics -fno-semantic-interposition -DASMJIT_STATIC -DASMJIT_TEST -O2 -fmerge-all-constants -fno-enforce-eh-specs -MD -MT CMakeFiles/asmjit_test_unit.dir/src/asmjit/core/constpool.cpp.o -MF CMakeFiles/asmjit_test_unit.dir/src/asmjit/core/constpool.cpp.o.d -o CMakeFiles/asmjit_test_unit.dir/src/asmjit/core/constpool.cpp.o -c "/build/reproducible-path/asmjit-0.0~git20231115.1da9e4d/src/asmjit/core/constpool.cpp"
[ 11%] Building CXX object CMakeFiles/asmjit_test_unit.dir/src/asmjit/core/compiler.cpp.o
/usr/bin/c++  -I"/build/reproducible-path/asmjit-0.0~git20231115.1da9e4d/src" -g -O2 -ffile-prefix-map=/build/reproducible-path/asmjit-0.0~git20231115.1da9e4d=. -fstack-protector-strong -fstack-clash-protection -Wformat -Werror=format-security -D_LARGEFILE_SOURCE -D_FILE_OFFSET_BITS=64 -D_TIME_BITS=64 -Wdate-time -D_FORTIFY_SOURCE=2 -fvisibility=hidden -Wall -Wextra -Wconversion -fno-math-errno -fno-threadsafe-statics -fno-semantic-interposition -DASMJIT_STATIC -DASMJIT_TEST -O2 -fmerge-all-constants -fno-enforce-eh-specs -MD -MT CMakeFiles/asmjit_test_unit.dir/src/asmjit/core/compiler.cpp.o -MF CMakeFiles/asmjit_test_unit.dir/src/asmjit/core/compiler.cpp.o.d -o CMakeFiles/asmjit_test_unit.dir/src/asmjit/core/compiler.cpp.o -c "/build/reproducible-path/asmjit-0.0~git20231115.1da9e4d/src/asmjit/core/compiler.cpp"
[ 12%] Building CXX object CMakeFiles/asmjit_test_unit.dir/src/asmjit/core/cpuinfo.cpp.o
/usr/bin/c++  -I"/build/reproducible-path/asmjit-0.0~git20231115.1da9e4d/src" -g -O2 -ffile-prefix-map=/build/reproducible-path/asmjit-0.0~git20231115.1da9e4d=. -fstack-protector-strong -fstack-clash-protection -Wformat -Werror=format-security -D_LARGEFILE_SOURCE -D_FILE_OFFSET_BITS=64 -D_TIME_BITS=64 -Wdate-time -D_FORTIFY_SOURCE=2 -fvisibility=hidden -Wall -Wextra -Wconversion -fno-math-errno -fno-threadsafe-statics -fno-semantic-interposition -DASMJIT_STATIC -DASMJIT_TEST -O2 -fmerge-all-constants -fno-enforce-eh-specs -MD -MT CMakeFiles/asmjit_test_unit.dir/src/asmjit/core/cpuinfo.cpp.o -MF CMakeFiles/asmjit_test_unit.dir/src/asmjit/core/cpuinfo.cpp.o.d -o CMakeFiles/asmjit_test_unit.dir/src/asmjit/core/cpuinfo.cpp.o -c "/build/reproducible-path/asmjit-0.0~git20231115.1da9e4d/src/asmjit/core/cpuinfo.cpp"
/build/reproducible-path/asmjit-0.0~git20231115.1da9e4d/src/asmjit/core/cpuinfo.cpp: In function 'void asmjit::_abi_1_11::arm::detectARMCpu(asmjit::_abi_1_11::CpuInfo&)':
/build/reproducible-path/asmjit-0.0~git20231115.1da9e4d/src/asmjit/core/cpuinfo.cpp:1578:20: error: 'hwCap2Masks' was not declared in this scope; did you mean 'hwCapMasks'?
 1578 |   mergeHWCaps(cpu, hwCap2Masks[0], hwCap2Mapping, ASMJIT_ARRAY_SIZE(hwCap2Mapping));
      |                    ^~~~~~~~~~~
      |                    hwCapMasks
make[3]: *** [CMakeFiles/asmjit_test_unit.dir/build.make:180: CMakeFiles/asmjit_test_unit.dir/src/asmjit/core/cpuinfo.cpp.o] Error 1
make[3]: *** Waiting for unfinished jobs....
make[3]: Leaving directory '/build/reproducible-path/asmjit-0.0~git20231115.1da9e4d/obj-arm-linux-gnueabihf'
make[2]: *** [CMakeFiles/Makefile2:143: CMakeFiles/asmjit_test_unit.dir/all] Error 2
make[2]: Leaving directory '/build/reproducible-path/asmjit-0.0~git20231115.1da9e4d/obj-arm-linux-gnueabihf'
make[1]: *** [Makefile:149: all] Error 2
make[1]: Leaving directory '/build/reproducible-path/asmjit-0.0~git20231115.1da9e4d/obj-arm-linux-gnueabihf'
dh_auto_build: error: cd obj-arm-linux-gnueabihf && make -j3 "INSTALL=install --strip-program=true" VERBOSE=1 returned exit code 2
make: *** [debian/rules:7: binary] Error 25
dpkg-buildpackage: error: debian/rules binary subprocess returned exit status 2
I: copying local configuration
E: Failed autobuilding of package
I: unmounting dev/ptmx filesystem
I: unmounting dev/pts filesystem
I: unmounting dev/shm filesystem
I: unmounting proc filesystem
I: unmounting sys filesystem
I: cleaning the build env 
I: removing directory /srv/workspace/pbuilder/8498 and its subdirectories
Mon Feb  3 22:22:23 UTC 2025  W: No second build log, what happened?